{"text_format":"1","workbook":"xlsx","n_sheets":7,"sheets":["Master Data","QR CODE ASMO","Card Template","Print Template","Data","Print","Kanban"],"not_rendered":{"charts":0,"images":51,"macros":1,"external_links":2,"defined_names":17,"comments":0,"pivot_tables":0},"unopened":[],"bounds":{"document_bytes":16777216,"sheet_cells":100000,"rows_first":2000,"rows_last":500,"rows_between":2000,"halvings":0,"cell_chars":16384,"cell_head_chars":4096},"cells_cut":0,"cells_raw":0,"read":"whole","date_system":"1900"}

{"sheet":"Master Data","index":0,"n_rows":292,"n_cols":12,"rows_kept":292,"cut":false,"hidden":true,"merged":[]}
[null,null,"DATA MASTER PART LIST SUPPLIER"]
[null,"No","Part No","SID No","Part No Drawing","Part Name","Model","Supplier","UoM","Code","Qty/Box","Unique No"]
[null,1,4073470031,"HP02","407347-0031","FRONT PIN RECLINING HINGE OUTER","D01N","TECHNO HOEI","PCS","01THI",200,{"$f":"\"*\"&Table2[[#This Row],[Part No Drawing]]&\"*\"","v":"*407347-0031*"}]
[null,2,4073470042,"HP03","407347-0042","REAR PIN RECLINING HINGE OUTER","D01N","TECHNO HOEI","PCS","01THI",200,{"$f":"\"*\"&Table2[[#This Row],[Part No Drawing]]&\"*\"","v":"*407347-0042*"}]
[null,3,4073470025,"HP04","407347-0025","PIN RECLINING HINGE OUTER","YL8/YR9","TECHNO HOEI","PCS","01THI",200,{"$f":"\"*\"&Table2[[#This Row],[Part No Drawing]]&\"*\"","v":"*407347-0025*"}]
[null,4,8010200107,"RV04","801020-0107","RIVET","660A LL","TECHNO HOEI","PCS","01THI",2000,{"$f":"\"*\"&Table2[[#This Row],[Part No Drawing]]&\"*\"","v":"*801020-0107*"}]
[null,5,8008100862,"PN03","800810-0862","PIN,WITH SHOULDER","3rd REC YL8","TECHNO HOEI","PCS","01THI",1000,{"$f":"\"*\"&Table2[[#This Row],[Part No Drawing]]&\"*\"","v":"*800810-0862*"}]
[null,6,8008100863,"PN04","800810-0863","PIN,WITH SHOULDER","3rd REC YL8","TECHNO HOEI","PCS","01THI",600,{"$f":"\"*\"&Table2[[#This Row],[Part No Drawing]]&\"*\"","v":"*800810-0863*"}]
[null,7,2035400091,"GS01","203540-0091","GEAR SHAFT ","810A","TECHNO HOEI","PCS","01THI",600,{"$f":"\"*\"&Table2[[#This Row],[Part No Drawing]]&\"*\"","v":"*203540-0091*"}]
[null,8,4073490123,"HP01","407349-0123","PIN,REC HNG","YR9 RR REC","TECHNO HOEI","PCS","01THI",500,{"$f":"\"*\"&Table2[[#This Row],[Part No Drawing]]&\"*\"","v":"*407349-0123*"}]
[null,9,8008100831,"PN01","800810-0831","PIN WITH SHOULDER","YR9 RR REC","TECHNO HOEI","PCS","01THI",600,{"$f":"\"*\"&Table2[[#This Row],[Part No Drawing]]&\"*\"","v":"*800810-0831*"}]
[null,10,8008100832,"PN02","800810-0832","PIN WITH SHOULDER","YR9 RR REC","TECHNO HOEI","PCS","01THI",1500,{"$f":"\"*\"&Table2[[#This Row],[Part No Drawing]]&\"*\"","v":"*800810-0832*"}]
[null,11,4079790005,"B147","407979-0005","SHAFT, TUMBLE HINGE","4L45W","TECHNO HOEI","PCS","01THI",60,{"$f":"\"*\"&Table2[[#This Row],[Part No Drawing]]&\"*\"","v":"*407979-0005*"}]
[null,12,4067090026,"PN15","406709-0026","PIN LOCK","D14N FLOOR LOCK","TECHNO HOEI","PCS","01THI",600,{"$f":"\"*\"&Table2[[#This Row],[Part No Drawing]]&\"*\"","v":"*406709-0026*"}]
[null,1,2020730428,"AGS05C","202073-0428","ARM SUB-ASSY, FRONT PWR WDO LIFT, RH","810A REG","ACT METAL","PCS","01AMC",24,{"$f":"\"*\"&Table2[[#This Row],[Part No Drawing]]&\"*\"","v":"*202073-0428*"}]
[null,2,2020740366,"AGS06C","202074-0366","ARM SUB-ASSY, FRONT PWR WDO LIFT, LH","810A REG","ACT METAL","PCS","01AMC",24,{"$f":"\"*\"&Table2[[#This Row],[Part No Drawing]]&\"*\"","v":"*202074-0366*"}]
[null,3,2020710266,"AGS07C","202071-0266","ARM SUB-ASSY, FRONT MNL WDO LIFT, RH","810A REG","ACT METAL","PCS","01AMC",24,{"$f":"\"*\"&Table2[[#This Row],[Part No Drawing]]&\"*\"","v":"*202071-0266*"}]
[null,4,2020720225,"AGS08C","202072-0225","ARM SUB-ASSY, FRONT MNL WDO LIFT, LH","810A REG","ACT METAL","PCS","01AMC",24,{"$f":"\"*\"&Table2[[#This Row],[Part No Drawing]]&\"*\"","v":"*202072-0225*"}]
[null,5,2020730366,"AGS09C","202073-0366","ARM SUB-ASSY, REAR PWR WDO LIFT, RH","810A REG","ACT METAL","PCS","01AMC",24,{"$f":"\"*\"&Table2[[#This Row],[Part No Drawing]]&\"*\"","v":"*202073-0366*"}]
[null,6,2020740333,"AGS10C","202074-0333","ARM SUB-ASSY, REAR PWR WDO LIFT, LH","810A REG","ACT METAL","PCS","01AMC",24,{"$f":"\"*\"&Table2[[#This Row],[Part No Drawing]]&\"*\"","v":"*202074-0333*"}]
[null,7,2020710267,"AGS11C","202071-0267","ARM SUB-ASSY, REAR MNL WDO LIFT, RH","810A REG","ACT METAL","PCS","01AMC",24,{"$f":"\"*\"&Table2[[#This Row],[Part No Drawing]]&\"*\"","v":"*202071-0267*"}]
[null,8,2020720226,"AGS12C","202072-0226","ARM SUB-ASSY, REAR MNL WDO LIFT, LH","810A REG","ACT METAL","PCS","01AMC",24,{"$f":"\"*\"&Table2[[#This Row],[Part No Drawing]]&\"*\"","v":"*202072-0226*"}]
[null,9,2020730470,"AGS13C","202073-0470","ARM SUB-ASSY, FRONT PWR WDO LIFT, RH","660A REG","ACT METAL","PCS","01AMC",24,{"$f":"\"*\"&Table2[[#This Row],[Part No Drawing]]&\"*\"","v":"*202073-0470*"}]
[null,10,2020740402,"AGS14C","202074-0402","ARM SUB-ASSY, FRONT PWR WDO LIFT, LH","660A REG","ACT METAL","PCS","01AMC",24,{"$f":"\"*\"&Table2[[#This Row],[Part No Drawing]]&\"*\"","v":"*202074-0402*"}]
[null,11,2020730484,"AGS15C","202073-0484","ARM SUB-ASSY, REAR PWR WDO LIFT, RH","660A REG","ACT METAL","PCS","01AMC",24,{"$f":"\"*\"&Table2[[#This Row],[Part No Drawing]]&\"*\"","v":"*202073-0484*"}]
[null,12,2020740414,"AGS16C","202074-0414","ARM SUB-ASSY, REAR PWR WDO LIFT, LH","660A REG","ACT METAL","PCS","01AMC",24,{"$f":"\"*\"&Table2[[#This Row],[Part No Drawing]]&\"*\"","v":"*202074-0414*"}]
[null,13,2020730553,"AGS17C","202073-0553","ARM SUB-ASSY, REAR PWR WDO LIFT, RH","800A REG","ACT METAL","PCS","01AMC",24,{"$f":"\"*\"&Table2[[#This Row],[Part No Drawing]]&\"*\"","v":"*202073-0553*"}]
[null,14,2020740472,"AGS18C","202074-0472","ARM SUB-ASSY, REAR PWR WDO LIFT, LH","800A REG","ACT METAL","PCS","01AMC",24,{"$f":"\"*\"&Table2[[#This Row],[Part No Drawing]]&\"*\"","v":"*202074-0472*"}]
[null,15,4510210287,"URS01C","451021-0287","UPPER RAIL OUT. S/A RH","YR9 SEAT TRACK","ACT METAL","PCS","01AMC",14,{"$f":"\"*\"&Table2[[#This Row],[Part No Drawing]]&\"*\"","v":"*451021-0287*"}]
[null,16,4510220264,"URS02C","451022-0264","UPPER RAIL OUT. S/A LH","YR9 SEAT TRACK","ACT METAL","PCS","01AMC",14,{"$f":"\"*\"&Table2[[#This Row],[Part No Drawing]]&\"*\"","v":"*451022-0264*"}]
[null,17,4510230314,"URS03C","451023-0314","UPPER RAIL INN. S/A RH","YR9 SEAT TRACK","ACT METAL","PCS","01AMC",14,{"$f":"\"*\"&Table2[[#This Row],[Part No Drawing]]&\"*\"","v":"*451023-0314*"}]
[null,18,4510240296,"URS04C","451024-0296","UPPER RAIL INN. S/A LH","YR9 SEAT TRACK","ACT METAL","PCS","01AMC",14,{"$f":"\"*\"&Table2[[#This Row],[Part No Drawing]]&\"*\"","v":"*451024-0296*"}]
[null,19,4048510027,"LR01C","404851-0027","LOWER RAIL OUT. RH","YL8/YR9 SEAT TRACK","ACT METAL","PCS","01AMC",14,{"$f":"\"*\"&Table2[[#This Row],[Part No Drawing]]&\"*\"","v":"*404851-0027*"}]
[null,20,4048520024,"LR02C","404852-0024","LOWER RAIL OUT. LH","YL8/YR9 SEAT TRACK","ACT METAL","PCS","01AMC",14,{"$f":"\"*\"&Table2[[#This Row],[Part No Drawing]]&\"*\"","v":"*404852-0024*"}]
[null,21,4048530029,"LR03C","404853-0029","LOWER RAIL INN. RH","YR9 SEAT TRACK","ACT METAL","PCS","01AMC",14,{"$f":"\"*\"&Table2[[#This Row],[Part No Drawing]]&\"*\"","v":"*404853-0029*"}]
[null,22,4048540030,"LR04C","404854-0030","LOWER RAIL INN. LH","YR9 SEAT TRACK","ACT METAL","PCS","01AMC",14,{"$f":"\"*\"&Table2[[#This Row],[Part No Drawing]]&\"*\"","v":"*404854-0030*"}]
[null,23,4048530034,"LR05C","404853-0034","RAIL,SEAT TRACK LWR INN,RH","YL8 SEAT TRACK","ACT METAL","PCS","01AMC",14,{"$f":"\"*\"&Table2[[#This Row],[Part No Drawing]]&\"*\"","v":"*404853-0034*"}]
[null,24,4048510028,"LR06C","404851-0028","RAIL,SEAT TRACK LWR OUT,RH","YL8 SEAT TRACK","ACT METAL","PCS","01AMC",14,{"$f":"\"*\"&Table2[[#This Row],[Part No Drawing]]&\"*\"","v":"*404851-0028*"}]
[null,25,4520530022,"RBS01C","452053-0022","REAR BRKT. S/A RH","YR9 SEAT TRACK","ACT METAL","PCS","01AMC",32,{"$f":"\"*\"&Table2[[#This Row],[Part No Drawing]]&\"*\"","v":"*452053-0022*"}]
[null,26,4520540018,"RBS02C","452054-0018","REAR BRKT. S/A LH","YR9 SEAT TRACK","ACT METAL","PCS","01AMC",32,{"$f":"\"*\"&Table2[[#This Row],[Part No Drawing]]&\"*\"","v":"*452054-0018*"}]
[null,27,2060510001,"LV03C","206051-0001","LEVER RH","D17D FLOOR LOCK","ACT METAL","PCS","01AMC",96,{"$f":"\"*\"&Table2[[#This Row],[Part No Drawing]]&\"*\"","v":"*206051-0001*"}]
[null,28,2060520001,"LV04C","206052-0001","LEVER LH","D17D FLOOR LOCK","ACT METAL","PCS","01AMC",96,{"$f":"\"*\"&Table2[[#This Row],[Part No Drawing]]&\"*\"","v":"*206052-0001*"}]
[null,29,4030450021,"PL01C","403045-0021","LOCK PLATE RH #1","D17D FLOOR LOCK","ACT METAL","PCS","01AMC",72,{"$f":"\"*\"&Table2[[#This Row],[Part No Drawing]]&\"*\"","v":"*403045-0021*"}]
[null,30,4030460018,"PL03C","403046-0018","LOCK PLATE LH #1","D17D FLOOR LOCK","ACT METAL","PCS","01AMC",72,{"$f":"\"*\"&Table2[[#This Row],[Part No Drawing]]&\"*\"","v":"*403046-0018*"}]
[null,31,4030450027,"PL12C","403045-0027","PLATE INTERLOCK RH #3","D30D FLOOR LOCK","ACT METAL","PCS","01AMC",60,{"$f":"\"*\"&Table2[[#This Row],[Part No Drawing]]&\"*\"","v":"*403045-0027*"}]
[null,32,4030460022,"PL13C","403046-0022","PLATE INTERLOCK LH #2","D30D FLOOR LOCK","ACT METAL","PCS","01AMC",60,{"$f":"\"*\"&Table2[[#This Row],[Part No Drawing]]&\"*\"","v":"*403046-0022*"}]
[null,33,4030450028,"PL14C","403045-0028","PLATE INTERLOCK RH #4","D30D FLOOR LOCK","ACT METAL","PCS","01AMC",60,{"$f":"\"*\"&Table2[[#This Row],[Part No Drawing]]&\"*\"","v":"*403045-0028*"}]
[null,34,4012030019,"BSS11C","401203-0019","INSIDE BASE S/A RH COATING","800A FLOOR LOCK","ACT METAL","PCS","01AMC",24,{"$f":"\"*\"&Table2[[#This Row],[Part No Drawing]]&\"*\"","v":"*401203-0019*"}]
[null,35,4012040020,"BSS12C","401204-0020","INSIDE BASE S/A LH COATING","800A FLOOR LOCK","ACT METAL","PCS","01AMC",24,{"$f":"\"*\"&Table2[[#This Row],[Part No Drawing]]&\"*\"","v":"*401204-0020*"}]
[null,36,4046550016,"BS09C","404655-0016","OUTSIDE BASE RH COATING","800A FLOOR LOCK","ACT METAL","PCS","01AMC",48,{"$f":"\"*\"&Table2[[#This Row],[Part No Drawing]]&\"*\"","v":"*404655-0016*"}]
[null,37,4046560018,"BS10C","404656-0018","OUTSIDE BASE LH COATING","800A FLOOR LOCK","ACT METAL","PCS","01AMC",48,{"$f":"\"*\"&Table2[[#This Row],[Part No Drawing]]&\"*\"","v":"*404656-0018*"}]
[null,38,4052650008,"LK01C","405265-0008","LINK INTERLOCK, RH","800A SLIDE DOOR","ACT METAL","PCS","01AMC",48,{"$f":"\"*\"&Table2[[#This Row],[Part No Drawing]]&\"*\"","v":"*405265-0008*"}]
[null,39,4052660007,"LK02C","405266-0007","LINK INTERLOCK, LH","800A SLIDE DOOR","ACT METAL","PCS","01AMC",48,{"$f":"\"*\"&Table2[[#This Row],[Part No Drawing]]&\"*\"","v":"*405266-0007*"}]
[null,40,3031610028,"PL04C","303161-0028","PLATE UPPER RH AFTER PLATTING","800A FLOOR LOCK","ACT METAL","PCS","01AMC",60,{"$f":"\"*\"&Table2[[#This Row],[Part No Drawing]]&\"*\"","v":"*303161-0028*"}]
[null,41,3031620028,"PL05C","303162-0028","PLATE UPPER LH AFTER PLATTING","800A FLOOR LOCK","ACT METAL","PCS","01AMC",60,{"$f":"\"*\"&Table2[[#This Row],[Part No Drawing]]&\"*\"","v":"*303162-0028*"}]
[null,42,4520470015,"FBS01C","452047-0015","FR LEG BRKT FRONT OUT S/A","4L45W S/T","ACT METAL","PCS","01AMC",20,{"$f":"\"*\"&Table2[[#This Row],[Part No Drawing]]&\"*\"","v":"*452047-0015*"}]
[null,43,4520430027,"FBS02C","452043-0027","FR LEG BRKT FRONT INN RH S/A","4L45W S/T","ACT METAL","PCS","01AMC",20,{"$f":"\"*\"&Table2[[#This Row],[Part No Drawing]]&\"*\"","v":"*452043-0027*"}]
[null,44,4520440024,"FBS03C","452044-0024","FR LEG BRKT FRONT INN LH S/A","4L45W S/T","ACT METAL","PCS","01AMC",20,{"$f":"\"*\"&Table2[[#This Row],[Part No Drawing]]&\"*\"","v":"*452044-0024*"}]
[null,45,4520430028,"FBS04C","452043-0028","FR LEG BRKT FRONT INN RH W/H S/A","4L45W S/T","ACT METAL","PCS","01AMC",20,{"$f":"\"*\"&Table2[[#This Row],[Part No Drawing]]&\"*\"","v":"*452043-0028*"}]
[null,46,4520440025,"FBS05C","452044-0025","FR LEG BRKT FRONT INN LH W/H S/A","4L45W S/T","ACT METAL","PCS","01AMC",20,{"$f":"\"*\"&Table2[[#This Row],[Part No Drawing]]&\"*\"","v":"*452044-0025*"}]
[null,47,4048570042,"LR07C","404857-0042","FR LOWER RAIL OUT AFTER COATING","4L45W S/T","ACT METAL","PCS","01AMC",14,{"$f":"\"*\"&Table2[[#This Row],[Part No Drawing]]&\"*\"","v":"*404857-0042*"}]
[null,48,4048580047,"LR08C","404858-0047","FR LOWER RAIL INN AFTER COATING","4L45W S/T","ACT METAL","PCS","01AMC",14,{"$f":"\"*\"&Table2[[#This Row],[Part No Drawing]]&\"*\"","v":"*404858-0047*"}]
[null,49,4042970052,"RB03C","404297-0052","FR LEG BRKT REAR OUT AFTER COATING","4L45W S/T","ACT METAL","PCS","01AMC",20,{"$f":"\"*\"&Table2[[#This Row],[Part No Drawing]]&\"*\"","v":"*404297-0052*"}]
[null,50,4042980025,"RB04C","404298-0025","FR LEG BRKT REAR INN AFTER COATING","4L45W S/T","ACT METAL","PCS","01AMC",60,{"$f":"\"*\"&Table2[[#This Row],[Part No Drawing]]&\"*\"","v":"*404298-0025*"}]
[null,51,4510570039,"LRS09C","451057-0039","RR LOWER RAIL OUT S/A AFTER COATING","4L45W S/T","ACT METAL","PCS","01AMC",14,{"$f":"\"*\"&Table2[[#This Row],[Part No Drawing]]&\"*\"","v":"*451057-0039*"}]
[null,52,4510580023,"LRS10C","451058-0023","RR LOWER RAIL INN S/A AFTER COATING","4L45W S/T","ACT METAL","PCS","01AMC",14,{"$f":"\"*\"&Table2[[#This Row],[Part No Drawing]]&\"*\"","v":"*451058-0023*"}]
[null,53,4532090069,"B139C","453209-0069","HANDLE , SEAT TRACK","4L45W S/T","ACT METAL","PCS","01AMC",15,{"$f":"\"*\"&Table2[[#This Row],[Part No Drawing]]&\"*\"","v":"*453209-0069*"}]
[null,54,4532050018,"B142C","453205-0018","HANDLE, SEAT TRACK, RIGHT","4L45W S/T","ACT METAL","PCS","01AMC",12,{"$f":"\"*\"&Table2[[#This Row],[Part No Drawing]]&\"*\"","v":"*453205-0018*"}]
[null,55,4532060017,"B143C","453206-0017","HANDLE, SEAT TRACK, LEFT","4L45W S/T","ACT METAL","PCS","01AMC",12,{"$f":"\"*\"&Table2[[#This Row],[Part No Drawing]]&\"*\"","v":"*453206-0017*"}]
[null,56,2020730573,"AGS19C","202073-0573","ARM GEAR S/A R/P RH","230B REG","ACT METAL","PCS","01AMC",24,{"$f":"\"*\"&Table2[[#This Row],[Part No Drawing]]&\"*\"","v":"*202073-0573*"}]
[null,57,2020740493,"AGS20C","202074-0493","ARM GEAR S/A R/P LH","230B REG","ACT METAL","PCS","01AMC",24,{"$f":"\"*\"&Table2[[#This Row],[Part No Drawing]]&\"*\"","v":"*202074-0493*"}]
[null,58,2020710313,"AGS21C","202071-0313","ARM GEAR S/A R/M RH","230B REG","ACT METAL","PCS","01AMC",24,{"$f":"\"*\"&Table2[[#This Row],[Part No Drawing]]&\"*\"","v":"*202071-0313*"}]
[null,59,2020720269,"AGS22C","202072-0269","ARM GEAR S/A R/M LH","230B REG","ACT METAL","PCS","01AMC",24,{"$f":"\"*\"&Table2[[#This Row],[Part No Drawing]]&\"*\"","v":"*202072-0269*"}]
[null,60,2020790034,"AGS23C","202079-0034","ARM GEAR S/A","YHA REG","ACT METAL","PCS","01AMC",24,{"$f":"\"*\"&Table2[[#This Row],[Part No Drawing]]&\"*\"","v":"*202079-0034*"}]
[null,61,4030450031,"PL19C","403045-0031","LOCK PLATE 2ND RH","D14N FLOOR LOCK","ACT METAL","PCS","01AMC",60,{"$f":"\"*\"&Table2[[#This Row],[Part No Drawing]]&\"*\"","v":"*403045-0031*"}]
[null,62,4030460023,"PL20C","403046-0023","LOCK PLATE 2ND LH","D14N FLOOR LOCK","ACT METAL","PCS","01AMC",60,{"$f":"\"*\"&Table2[[#This Row],[Part No Drawing]]&\"*\"","v":"*403046-0023*"}]
[null,63,4030450032,"PL21C","403045-0032","LOCK PLATE 3RD RH","D14N FLOOR LOCK","ACT METAL","PCS","01AMC",60,{"$f":"\"*\"&Table2[[#This Row],[Part No Drawing]]&\"*\"","v":"*403045-0032*"}]
[null,64,4030460024,"PL22C","403046-0024","LOCK PLATE 3RD LH","D14N FLOOR LOCK","ACT METAL","PCS","01AMC",60,{"$f":"\"*\"&Table2[[#This Row],[Part No Drawing]]&\"*\"","v":"*403046-0024*"}]
[null,65,4057550007,"CM05C","405755-0007","CAM RH","D14N FLOOR LOCK","ACT METAL","PCS","01AMC",400,{"$f":"\"*\"&Table2[[#This Row],[Part No Drawing]]&\"*\"","v":"*405755-0007*"}]
[null,66,4057560006,"CM06C","405756-0006","CAM LH","D14N FLOOR LOCK","ACT METAL","PCS","01AMC",400,{"$f":"\"*\"&Table2[[#This Row],[Part No Drawing]]&\"*\"","v":"*405756-0006*"}]
[null,67,451059003901,"LRS11C","451059-0039-01","RAIL SUB-ASSY, LOWER OUTER","YHA SEAT TRACK","ACT METAL","PCS","01AMC",14,{"$f":"\"*\"&Table2[[#This Row],[Part No Drawing]]&\"*\"","v":"*451059-0039-01*"}]
[null,68,451059003902,"LRS12C","451059-0039-02","RAIL SUB-ASSY, LOWER INNER","YHA SEAT TRACK","ACT METAL","PCS","01AMC",14,{"$f":"\"*\"&Table2[[#This Row],[Part No Drawing]]&\"*\"","v":"*451059-0039-02*"}]
[null,1,2030290091,"AM01","203029-0091","FRONT LIFT ARM","700A","AISIN INDONESIA","PCS","01AIS",60,"*GA1B*"]
[null,2,2030270086,"AM02","203027-0086","REAR LIFT ARM RH","700A & 800A","AISIN INDONESIA","PCS","01AIS",60,"*GA2B*"]
[null,3,2030280073,"AM03","203028-0073","REAR LIFT ARM LH","700A & 800A","AISIN INDONESIA","PCS","01AIS",60,"*GA3B*"]
[null,4,2032000115,"EA02","203200-0115","EQUALIZER ARM A","ALL REG","AISIN INDONESIA","PCS","01AIS",100,"*GG1A*"]
[null,5,2032000116,"EA01","203200-0116","EQUALIZER ARM B","ALL REG","AISIN INDONESIA","PCS","01AIS",100,"*GG2A*"]
[null,6,2034010057,"LB01","203401-0057","LIFT ARM BRACKET RH","ALL REG","AISIN INDONESIA","PCS","01AIS",60,"*GG3A*"]
[null,7,2034020055,"LB02","203402-0055","LIFT ARM BRACKET LH","ALL REG","AISIN INDONESIA","PCS","01AIS",60,"*GG4A*"]
[null,8,2034500069,"EB01","203450-0069","EQUALIZER ARM BRACKET","700A","AISIN INDONESIA","PCS","01AIS",120,"*GG5A*"]
[null,9,2031190034,"BP01","203119-0034","BASE PLATE","700A","AISIN INDONESIA","PCS","01AIS",50,"*GB1A*"]
[null,1,2020730425,"AGS01C","202073-0425","PLATING ARM GEAR S/A, FR POWER RH","700A","ASNO HORIE","PCS","01ASN",24,{"$f":"\"*\"&Table2[[#This Row],[Part No Drawing]]&\"*\"","v":"*202073-0425*"}]
[null,2,2020740363,"AGS02C","202074-0363","PLATING ARM GEAR S/A, FR POWER LH","700A","ASNO HORIE","PCS","01ASN",24,{"$f":"\"*\"&Table2[[#This Row],[Part No Drawing]]&\"*\"","v":"*202074-0363*"}]
[null,3,2020730426,"AGS03C","202073-0426","PLATING ARM GEAR S/A,RR POWER RH","700A","ASNO HORIE","PCS","01ASN",24,{"$f":"\"*\"&Table2[[#This Row],[Part No Drawing]]&\"*\"","v":"*202073-0426*"}]
[null,4,2020740364,"AGS04C","202074-0364","PLATING ARM GEAR S/A, RR POWER LH","700A","ASNO HORIE","PCS","01ASN",24,{"$f":"\"*\"&Table2[[#This Row],[Part No Drawing]]&\"*\"","v":"*202074-0364*"}]
[null,1,3011730005,"HK03","301173-0005","HOOK RH","800A Slide Door Lock","CHIYODA","PCS","01CYD",300,{"$f":"\"*\"&Table2[[#This Row],[Part No Drawing]]&\"*\"","v":"*301173-0005*"}]
[null,2,3011740006,"HK04","301174-0006","HOOK LH","800A Slide Door Lock","CHIYODA","PCS","01CYD",300,{"$f":"\"*\"&Table2[[#This Row],[Part No Drawing]]&\"*\"","v":"*301174-0006*"}]
[null,3,4532090098,"B154","453209-0098","HANDLE, SEAT TRACK","YHA HANDLE ADJUSTER","CHIYODA","PCS","01CYD",30,{"$f":"\"*\"&Table2[[#This Row],[Part No Drawing]]&\"*\"","v":"*453209-0098*"}]
[null,1,"857100D180","MO01","85710-0D180","MOTOR SUB ASSY, WDO REG RH","700A REG","DENSO","PCS","01DSI",{"$f":"VLOOKUP(Table2[[#This Row],[SID No]],'[1]MASTER DATA SUPPLIER'!$F$69:$L$230,7,0)","v":24},{"$f":"\"*\"&Table2[[#This Row],[Part No Drawing]]&\"*\"","v":"*85710-0D180*"}]
[null,2,"857200D310","MO02","85720-0D310","MOTOR SUB ASSY, WDO REG LH","700A REG","DENSO","PCS","01DSI",24,{"$f":"\"*\"&Table2[[#This Row],[Part No Drawing]]&\"*\"","v":"*85720-0D310*"}]
[null,3,"857100K010","MO03","85710-0K010","FRONT MOTOR RH","810A REG","DENSO","PCS","01DSI",18,{"$f":"\"*\"&Table2[[#This Row],[Part No Drawing]]&\"*\"","v":"*85710-0K010*"}]
[null,4,"857010D030","MO04","85701-0D030","MOTOR RH","810A/800A/230B","DENSO","PCS","01DSI",18,{"$f":"\"*\"&Table2[[#This Row],[Part No Drawing]]&\"*\"","v":"*85701-0D030*"}]
[null,5,"857200K010","MO05","85720-0K010","FRONT MOTOR LH","810A REG","DENSO","PCS","01DSI",18,{"$f":"\"*\"&Table2[[#This Row],[Part No Drawing]]&\"*\"","v":"*85720-0K010*"}]
[null,6,"857020D040","MO06","85702-0D040","MOTOR LH","810A","DENSO","PCS","01DSI",18,{"$f":"\"*\"&Table2[[#This Row],[Part No Drawing]]&\"*\"","v":"*85702-0D040*"}]
[null,7,"857100D220","MO07","85710-0D220","REAR MOTOR RH","810A REG","DENSO","PCS","01DSI",24,{"$f":"\"*\"&Table2[[#This Row],[Part No Drawing]]&\"*\"","v":"*85710-0D220*"}]
[null,8,"857200D260","MO08","85720-0D260","REAR MOTOR LH","810A REG","DENSO","PCS","01DSI",24,{"$f":"\"*\"&Table2[[#This Row],[Part No Drawing]]&\"*\"","v":"*85720-0D260*"}]
[null,9,"8356077M01","MO09","83560-77M01","MOTOR POWER WINDOW RH","YL8 REG","DENSO","PCS","01DSI",24,{"$f":"\"*\"&Table2[[#This Row],[Part No Drawing]]&\"*\"","v":"*83560-77M01*"}]
[null,10,"8353077M01","MO10","83530-77M01","MOTOR POWER WINDOOW LH","YL8 REG","DENSO","PCS","01DSI",24,{"$f":"\"*\"&Table2[[#This Row],[Part No Drawing]]&\"*\"","v":"*83530-77M01*"}]
[null,11,"8343077M10","MO11","83430-77M10","MOTOR POWER WINDOW RH JAM","YL8 REG","DENSO","PCS","01DSI",18,{"$f":"\"*\"&Table2[[#This Row],[Part No Drawing]]&\"*\"","v":"*83430-77M10*"}]
[null,12,"857100K190","MO12","85710-0K190","MOTOR RH JAM","660A REG","DENSO","PCS","01DSI",18,{"$f":"\"*\"&Table2[[#This Row],[Part No Drawing]]&\"*\"","v":"*85710-0K190*"}]
[null,13,"857200K190","MO13","85720-0K190","MOTOR LH JAM","660A REG","DENSO","PCS","01DSI",18,{"$f":"\"*\"&Table2[[#This Row],[Part No Drawing]]&\"*\"","v":"*85720-0K190*"}]
[null,14,"857200K270","MO14","85720-0K270","MOTOR RH JAM","660A REG","DENSO","PCS","01DSI",18,{"$f":"\"*\"&Table2[[#This Row],[Part No Drawing]]&\"*\"","v":"*85720-0K270*"}]
[null,15,"857100K270","MO15","85710-0K270","MOTOR LH JAM","660A REG","DENSO","PCS","01DSI",18,{"$f":"\"*\"&Table2[[#This Row],[Part No Drawing]]&\"*\"","v":"*85710-0K270*"}]
[null,16,"857100K180","MO16","85710-0K180","MOTOR RH ","660A REG","DENSO","PCS","01DSI",18,{"$f":"\"*\"&Table2[[#This Row],[Part No Drawing]]&\"*\"","v":"*85710-0K180*"}]
[null,17,"857100K070","MO17","85710-0K070","MOTOR RH JAM","660A REG","DENSO","PCS","01DSI",18,{"$f":"\"*\"&Table2[[#This Row],[Part No Drawing]]&\"*\"","v":"*85710-0K070*"}]
[null,18,"857200K180","MO18","85720-0K180","MOTOR LH ","660A REG","DENSO","PCS","01DSI",18,{"$f":"\"*\"&Table2[[#This Row],[Part No Drawing]]&\"*\"","v":"*85720-0K180*"}]
[null,19,"857200K070","MO19","85720-0K070","MOTOR LH JAM","660A REG","DENSO","PCS","01DSI",18,{"$f":"\"*\"&Table2[[#This Row],[Part No Drawing]]&\"*\"","v":"*85720-0K070*"}]
[null,20,"857200K090","MO20","85720-0K090","MOTOR LH JAM","660A REG","DENSO","PCS","01DSI",18,{"$f":"\"*\"&Table2[[#This Row],[Part No Drawing]]&\"*\"","v":"*85720-0K090*"}]
[null,21,"857100K080","MO21","85710-0K080","MOTOR RH JAM","660A REG","DENSO","PCS","01DSI",18,{"$f":"\"*\"&Table2[[#This Row],[Part No Drawing]]&\"*\"","v":"*85710-0K080*"}]
[null,22,"857100D520","MO25","85710-0D520","MOTOR RR POWER REG, RH","230B REG","DENSO","PCS","01DSI",20,{"$f":"\"*\"&Table2[[#This Row],[Part No Drawing]]&\"*\"","v":"*85710-0D520*"}]
[null,23,"857200D520","MO26","85720-0D520","MOTOR RR POWER REG, LH","230B REG","DENSO","PCS","01DSI",20,{"$f":"\"*\"&Table2[[#This Row],[Part No Drawing]]&\"*\"","v":"*85720-0D520*"}]
[null,24,"8353084M00","MO27","83530-84M00","MOTOR RH","YHA REG","DENSO","PCS","01DSI",24,{"$f":"\"*\"&Table2[[#This Row],[Part No Drawing]]&\"*\"","v":"*83530-84M00*"}]
[null,25,"8356084M00","MO28","83560-84M00","MOTOR LH","YHA REG","DENSO","PCS","01DSI",24,{"$f":"\"*\"&Table2[[#This Row],[Part No Drawing]]&\"*\"","v":"*83560-84M00*"}]
[null,26,"8343073R10","MO29","83430-73R10","MOTOR RH JAMPRO","YHA REG","DENSO","PCS","01DSI",24,{"$f":"\"*\"&Table2[[#This Row],[Part No Drawing]]&\"*\"","v":"*83430-73R10*"}]
[null,27,"8346073R10","MO30","83460-73R10","MOTOR LH JAMPRO","YHA REG","DENSO","PCS","01DSI",24,{"$f":"\"*\"&Table2[[#This Row],[Part No Drawing]]&\"*\"","v":"*83460-73R10*"}]
[null,28,"857100D321","MO31","85710-0D321","MOTOR RH JAM","800A REG","DENSO","PCS","01DSI",18,{"$f":"\"*\"&Table2[[#This Row],[Part No Drawing]]&\"*\"","v":"*85710-0D321*"}]
[null,1,3032910004,"CV01","303291-0004","COVER LOWER RH","800A Slide Door Lock","DNTI","PCS","01DTI",20,{"$f":"\"*\"&Table2[[#This Row],[Part No Drawing]]&\"*\"","v":"*303291-0004*"}]
[null,2,3032920004,"CV02","303292-0004","COVER LOWER LH","800A Slide Door Lock","DNTI","PCS","01DTI",20,{"$f":"\"*\"&Table2[[#This Row],[Part No Drawing]]&\"*\"","v":"*303292-0004*"}]
[null,1,8020000301,"TS04","802000-0301","SPRING, TENSION","D17D","FUJISPRING","PCS","01FSI",500,{"$f":"\"*\"&Table2[[#This Row],[Part No Drawing]]&\"*\"","v":"*802000-0301*"}]
[null,2,8020110128,"TS02","802011-0128","SPRING TORSION, RH","YL8/YR9 FR REC","FUJISPRING","PCS","01FSI",500,{"$f":"\"*\"&Table2[[#This Row],[Part No Drawing]]&\"*\"","v":"*802011-0128*"}]
[null,3,8020120131,"TS03","802012-0131","SPRING TORSION, LH","YL8/YR9 FR REC","FUJISPRING","PCS","01FSI",500,{"$f":"\"*\"&Table2[[#This Row],[Part No Drawing]]&\"*\"","v":"*802012-0131*"}]
[null,4,4013690074,"TSS02","401369-0074","SPRING, TENSION WITH DAMPER","YL8 3rd","FUJISPRING","PCS","01FSI",500,{"$f":"\"*\"&Table2[[#This Row],[Part No Drawing]]&\"*\"","v":"*401369-0074*"}]
[null,5,4534390027,"WI01","453439-0027","WIRE, SEAT","2SJ","FUJISPRING","PCS","01FSI",300,{"$f":"\"*\"&Table2[[#This Row],[Part No Drawing]]&\"*\"","v":"*453439-0027*"}]
[null,6,4013690081,"TSS03","401369-0081","SPRING TENSION W/DAMPER","800A FL","FUJISPRING","PCS","01FSI",4800,{"$f":"\"*\"&Table2[[#This Row],[Part No Drawing]]&\"*\"","v":"*401369-0081*"}]
[null,7,8020110300,"TS10","802011-0300","TORSION SPRING RH","800A FL","FUJISPRING","PCS","01FSI",180,{"$f":"\"*\"&Table2[[#This Row],[Part No Drawing]]&\"*\"","v":"*802011-0300*"}]
[null,8,8020120308,"TS11","802012-0308","TORSION SPRING LH","800A FL","FUJISPRING","PCS","01FSI",180,{"$f":"\"*\"&Table2[[#This Row],[Part No Drawing]]&\"*\"","v":"*802012-0308*"}]
[null,9,8020120086,"TS09","802012-0086","TORSION SPRING LH","800A SD","FUJISPRING","PCS","01FSI",1400,{"$f":"\"*\"&Table2[[#This Row],[Part No Drawing]]&\"*\"","v":"*802012-0086*"}]
[null,10,8020110086,"TS08","802011-0086","TORSION SPRING RH","800A SD","FUJISPRING","PCS","01FSI",1400,{"$f":"\"*\"&Table2[[#This Row],[Part No Drawing]]&\"*\"","v":"*802011-0086*"}]
[null,11,8020120290,"TS07","802012-0290","TORSION SPRING LH","800A SD","FUJISPRING","PCS","01FSI",1400,{"$f":"\"*\"&Table2[[#This Row],[Part No Drawing]]&\"*\"","v":"*802012-0290*"}]
[null,12,8020110284,"TS06","802011-0284","TORSION SPRING RH","800A SD","FUJISPRING","PCS","01FSI",1400,{"$f":"\"*\"&Table2[[#This Row],[Part No Drawing]]&\"*\"","v":"*802011-0284*"}]
[null,13,4013690079,"TS12","401369-0079","SPRING, TENSION WITH DAMPER","D30D","FUJISPRING","PCS","01FSI",1500,{"$f":"\"*\"&Table2[[#This Row],[Part No Drawing]]&\"*\"","v":"*401369-0079*"}]
[null,14,4013690080,"TS13","401369-0080","SPRING, TENSION WITH DAMPER","D30D","FUJISPRING","PCS","01FSI",2000,{"$f":"\"*\"&Table2[[#This Row],[Part No Drawing]]&\"*\"","v":"*401369-0080*"}]
[null,15,4013690066,"TSS01","401369-0066 ","SPRING, TENSION WITH DAMPER","YR9 RR REC","FUJISPRING","PCS","01FSI",500,{"$f":"\"*\"&Table2[[#This Row],[Part No Drawing]]&\"*\"","v":"*401369-0066 *"}]
[null,16,8020110306,"TS14","802011-0306","TORSION SPRING RH","4L45W","FUJISPRING","PCS","01FSI",2000,{"$f":"\"*\"&Table2[[#This Row],[Part No Drawing]]&\"*\"","v":"*802011-0306*"}]
[null,17,8020110307,"TS15","802011-0307","TORSION SPRING RH","4L45W","FUJISPRING","PCS","01FSI",1000,{"$f":"\"*\"&Table2[[#This Row],[Part No Drawing]]&\"*\"","v":"*802011-0307*"}]
[null,18,8020120315,"TS16","802012-0315","TORSION SPRING LH","4L45W","FUJISPRING","PCS","01FSI",2000,{"$f":"\"*\"&Table2[[#This Row],[Part No Drawing]]&\"*\"","v":"*802012-0315*"}]
[null,19,8020120316,"TS17","802012-0316","TORSION SPRING LH","4L45W","FUJISPRING","PCS","01FSI",1000,{"$f":"\"*\"&Table2[[#This Row],[Part No Drawing]]&\"*\"","v":"*802012-0316*"}]
[null,1,4532090039,"B031","453209-0039","YL8 HANDLE FR SEAT ADJUSTER","YL8 ADJ","FUKUYAMA","PCS","01FKI",24,{"$f":"\"*\"&Table2[[#This Row],[Part No Drawing]]&\"*\"","v":"*453209-0039*"}]
[null,2,4532090025,"B025","453209-0025","YR9 HANDLE FR SEAT ADJUSTER","YR9 ADJ","FUKUYAMA","PCS","01FKI",24,{"$f":"\"*\"&Table2[[#This Row],[Part No Drawing]]&\"*\"","v":"*453209-0025*"}]
[null,3,4035610002,"BK01","403561-0002","BRACKET, CUSHION, RH ","YL8 3rd REC","FUKUYAMA","PCS","01FKI",250,{"$f":"\"*\"&Table2[[#This Row],[Part No Drawing]]&\"*\"","v":"*403561-0002*"}]
[null,4,4035620002,"BK02","403562-0002","BRACKET, CUSHION, LH","YL8 3rd REC","FUKUYAMA","PCS","01FKI",250,{"$f":"\"*\"&Table2[[#This Row],[Part No Drawing]]&\"*\"","v":"*403562-0002*"}]
[null,5,4051850051,"RA05","405185-0051","ARM, RELEASE, RH","YL8 3rd REC","FUKUYAMA","PCS","01FKI",500,{"$f":"\"*\"&Table2[[#This Row],[Part No Drawing]]&\"*\"","v":"*405185-0051*"}]
[null,6,4051860050,"RA06","405186-0050","ARM, RELEASE, LH","YL8 3rd REC","FUKUYAMA","PCS","01FKI",500,{"$f":"\"*\"&Table2[[#This Row],[Part No Drawing]]&\"*\"","v":"*405186-0050*"}]
[null,7,4045930012,"HB02","404593-0012","FRONT HARNESS BRKT INNER RH","4L45W","FUKUYAMA","PCS","01FKI",100,{"$f":"\"*\"&Table2[[#This Row],[Part No Drawing]]&\"*\"","v":"*404593-0012*"}]
[null,8,4045940009,"HB03","404594-0009","FRONT HARNESS BRKT INNER LH","4L45W","FUKUYAMA","PCS","01FKI",100,{"$f":"\"*\"&Table2[[#This Row],[Part No Drawing]]&\"*\"","v":"*404594-0009*"}]
[null,9,4045930011,"HB04","404593-0011","BRACKET, WIRE HARNESS CONNECTING INNER, RH","YHA SEAT TRACK","FUKUYAMA","PCS","01FKI",100,{"$f":"\"*\"&Table2[[#This Row],[Part No Drawing]]&\"*\"","v":"*404593-0011*"}]
[null,10,4045940011,"HB05","404594-0011","BRACKET, WIRE HARNESS CONNECTING INNER, LH","YHA SEAT TRACK","FUKUYAMA","PCS","01FKI",100,{"$f":"\"*\"&Table2[[#This Row],[Part No Drawing]]&\"*\"","v":"*404594-0011*"}]
[null,11,4037580004,"BK11","403758-0004","BRACKET, SEAT TRACK UPPER RAIL FR INNER","YHA SEAT TRACK","FUKUYAMA","PCS","01FKI",500,{"$f":"\"*\"&Table2[[#This Row],[Part No Drawing]]&\"*\"","v":"*403758-0004*"}]
[null,1,"789200D020","CB02","78920-0D020","CABLE","800A Floor Lock","HILEX","PCS","01HLX",120,{"$f":"\"*\"&Table2[[#This Row],[Part No Drawing]]&\"*\"","v":"*78920-0D020*"}]
[null,2,"789200D030","CB03","78920-0D030","CABLE","800A Floor Lock","HILEX","PCS","01HLX",120,{"$f":"\"*\"&Table2[[#This Row],[Part No Drawing]]&\"*\"","v":"*78920-0D030*"}]
[null,3,3061790044,"CB01","306179-0044","CABLE ASSY","800A Slide Door Lock","HILEX","PCS","01HLX",100,{"$f":"\"*\"&Table2[[#This Row],[Part No Drawing]]&\"*\"","v":"*306179-0044*"}]
[null,1,2023000036,"ROS01","202300-0036","ROLLER PIN GRAY","ALL REG","ITOMOL","PCS","01ITM",800,{"$f":"\"*\"&Table2[[#This Row],[Part No Drawing]]&\"*\"","v":"*202300-0036*"}]
[null,2,2023000034,"ROS03","202300-0034","ROLLER PIN BLACK","ALL REG","ITOMOL","PCS","01ITM",800,{"$f":"\"*\"&Table2[[#This Row],[Part No Drawing]]&\"*\"","v":"*202300-0034*"}]
[null,3,2023000026,"ROS02","202300-0026","ROLLER PIN WHITE","ALL REG","ITOMOL","PCS","01ITM",800,{"$f":"\"*\"&Table2[[#This Row],[Part No Drawing]]&\"*\"","v":"*202300-0026*"}]
[null,4,4547390045,"GD04NT","454739-0045","BALL GUIDE (NATURAL)","4L45W","ITOMOL","PCS","01ITM",2000,{"$f":"\"*\"&Table2[[#This Row],[Part No Drawing]]&\"*\"","v":"*454739-0045*"}]
[null,5,4547390046,"GD04BL","454739-0046","BALL GUIDE (BLUE)","4L45W","ITOMOL","PCS","01ITM",2000,{"$f":"\"*\"&Table2[[#This Row],[Part No Drawing]]&\"*\"","v":"*454739-0046*"}]
[null,6,4547390047,"GD04YE","454739-0047","BALL GUIDE (YELLOW)","4L45W","ITOMOL","PCS","01ITM",2000,{"$f":"\"*\"&Table2[[#This Row],[Part No Drawing]]&\"*\"","v":"*454739-0047*"}]
[null,7,4547390042,"GD04BK","454739-0042","BALL GUIDE (BLACK)","4L45W","ITOMOL","PCS","01ITM",2000,{"$f":"\"*\"&Table2[[#This Row],[Part No Drawing]]&\"*\"","v":"*454739-0042*"}]
[null,1,4084590168,"BU03","408459-0168","SPACER #1","COMMON FLOOR LOCK","MEIDOH","PCS","01MEI",840,{"$f":"\"*\"&Table2[[#This Row],[Part No Drawing]]&\"*\"","v":"*408459-0168*"}]
[null,2,4084590169,"BU04","408459-0169","SPACER #2","COMMON FLOOR LOCK","MEIDOH","PCS","01MEI",800,{"$f":"\"*\"&Table2[[#This Row],[Part No Drawing]]&\"*\"","v":"*408459-0169*"}]
[null,1,4030450025,"PL08","403045-0025","PLATE INTER LOCK RH","800A Floor Lock","MARUTAKE","PCS","01MRT",600,{"$f":"\"*\"&Table2[[#This Row],[Part No Drawing]]&\"*\"","v":"*403045-0025*"}]
[null,2,4030460020,"PL09","403046-0020","PLATE INTER LOCK LH","800A Floor Lock","MARUTAKE","PCS","01MRT",600,{"$f":"\"*\"&Table2[[#This Row],[Part No Drawing]]&\"*\"","v":"*403046-0020*"}]
[null,3,4030450026,"PL10","403045-0026","PLATE INTER LOCK RH","800A Floor Lock","MARUTAKE","PCS","01MRT",500,{"$f":"\"*\"&Table2[[#This Row],[Part No Drawing]]&\"*\"","v":"*403045-0026*"}]
[null,4,4030460021,"PL11","403046-0021","PLATE INTER LOCK LH","800A Floor Lock","MARUTAKE","PCS","01MRT",500,{"$f":"\"*\"&Table2[[#This Row],[Part No Drawing]]&\"*\"","v":"*403046-0021*"}]
[null,5,3031630013,"PL06","303163-0013","PLATE LOWER RH","800A Slide Door Lock","MARUTAKE","PCS","01MRT",150,{"$f":"\"*\"&Table2[[#This Row],[Part No Drawing]]&\"*\"","v":"*303163-0013*"}]
[null,6,3031640014,"PL07","303164-0014","PLATE LOWER LH","800A Slide Door Lock","MARUTAKE","PCS","01MRT",150,{"$f":"\"*\"&Table2[[#This Row],[Part No Drawing]]&\"*\"","v":"*303164-0014*"}]
[null,7,3041730001,"RT04","304173-0001","RATCHET RH","800A Slide Door Lock","MARUTAKE.","PCS","02MRT",300,{"$f":"\"*\"&Table2[[#This Row],[Part No Drawing]]&\"*\"","v":"*304173-0001*"}]
[null,8,3041740002,"RT05","304174-0002","RATCHET LH","800A Slide Door Lock","MARUTAKE.","PCS","02MRT",300,{"$f":"\"*\"&Table2[[#This Row],[Part No Drawing]]&\"*\"","v":"*304174-0002*"}]
[null,1,4546150007,"DP01","454615-0007","DAMPER, RIGHT","COMMON FLOOR LOCK","NESINAK","PCS","01NSK",1000,{"$f":"\"*\"&Table2[[#This Row],[Part No Drawing]]&\"*\"","v":"*454615-0007*"}]
[null,2,4546160006,"DP03","454616-0006","DAMPER, LEFT","COMMON FLOOR LOCK","NESINAK","PCS","01NSK",1000,{"$f":"\"*\"&Table2[[#This Row],[Part No Drawing]]&\"*\"","v":"*454616-0006*"}]
[null,1,4073490151,"HP05","407349-0151","HINGE,PIN","YL8 3RD REC","TSURUTA","PCS","01TSU",350,{"$f":"\"*\"&Table2[[#This Row],[Part No Drawing]]&\"*\"","v":"*407349-0151*"}]
[null,2,4077090031,"PN05","407709-0031","PIN, PAWL","D17D","TSURUTA","PCS","01TSU",2000,{"$f":"\"*\"&Table2[[#This Row],[Part No Drawing]]&\"*\"","v":"*407709-0031*"}]
[null,3,4073490167,"HP06","407349-0167","PIN, RECLINING HINGE","2SJ","TSURUTA","PCS","01TSU",500,{"$f":"\"*\"&Table2[[#This Row],[Part No Drawing]]&\"*\"","v":"*407349-0167*"}]
[null,4,4067390036,"PN08","406739-0036","CONNECTING PIN","800A SEAT LOCK","TSURUTA","PCS","01TSU",1000,{"$f":"\"*\"&Table2[[#This Row],[Part No Drawing]]&\"*\"","v":"*406739-0036*"}]
[null,5,4066190034,"PN09","406619-0034","HINGE PIN","800A SEAT LOCK","TSURUTA","PCS","01TSU",300,{"$f":"\"*\"&Table2[[#This Row],[Part No Drawing]]&\"*\"","v":"*406619-0034*"}]
[null,6,4077090032,"PN10","407709-0032","PAWL PIN","800A SEAT LOCK","TSURUTA","PCS","01TSU",300,{"$f":"\"*\"&Table2[[#This Row],[Part No Drawing]]&\"*\"","v":"*407709-0032*"}]
[null,7,4067390037,"PN11","406739-0037","CONNECTING PIN","800A SEAT LOCK","TSURUTA","PCS","01TSU",800,{"$f":"\"*\"&Table2[[#This Row],[Part No Drawing]]&\"*\"","v":"*406739-0037*"}]
[null,8,4067090019,"PN14","406709-0019","PIN, LOCK","800A SEAT LOCK","TSURUTA","PCS","01TSU",800,{"$f":"\"*\"&Table2[[#This Row],[Part No Drawing]]&\"*\"","v":"*406709-0019*"}]
[null,9,8008100897,"PN06","800810-0897","PIN WITH SHOULDER","800A SLIDE DOOR LOCK","TSURUTA","PCS","01TSU",1400,{"$f":"\"*\"&Table2[[#This Row],[Part No Drawing]]&\"*\"","v":"*800810-0897*"}]
[null,10,8008100472,"PN07","800810-0472","PIN WITH SHOULDER","800A SLIDE DOOR LOCK","TSURUTA","PCS","01TSU",1400,{"$f":"\"*\"&Table2[[#This Row],[Part No Drawing]]&\"*\"","v":"*800810-0472*"}]
[null,11,4067090020,"PN12","406709-0020","PIN, LOCK","D30D","TSURUTA","PCS","01TSU",1000,{"$f":"\"*\"&Table2[[#This Row],[Part No Drawing]]&\"*\"","v":"*406709-0020*"}]
[null,12,4067090021,"PN13","406709-0021","PIN, LOCK","D30D","TSURUTA","PCS","01TSU",400,{"$f":"\"*\"&Table2[[#This Row],[Part No Drawing]]&\"*\"","v":"*406709-0021*"}]
[null,13,8010000029,"RV05","801000-0029","RIVET (Φ8)","4L45W","TSURUTA","PCS","01TSU",1000,{"$f":"\"*\"&Table2[[#This Row],[Part No Drawing]]&\"*\"","v":"*801000-0029*"}]
[null,14,8010000040,"RV06","801000-0040","RIVET (Φ10)","4L45W","TSURUTA","PCS","01TSU",600,{"$f":"\"*\"&Table2[[#This Row],[Part No Drawing]]&\"*\"","v":"*801000-0040*"}]
[null,1,8005600019,"WN01","800560-0019","NUT, WELD","YL8 3rd REC","YAHATA","PCS","01YHT",2000,{"$f":"\"*\"&Table2[[#This Row],[Part No Drawing]]&\"*\"","v":"*800560-0019*"}]
[null,2,8003500002,"SW01","800350-0002","SCREW, TAPPING","ALL REG","YAHATA","PCS","01YHT",4000,{"$f":"\"*\"&Table2[[#This Row],[Part No Drawing]]&\"*\"","v":"*800350-0002*"}]
[null,1,405755000401,"CM03","405755-0004","CAM, RH","D17D/D30D FB","DOWA","PCS","01DWA",400,{"$f":"\"*\"&Table2[[#This Row],[Part No Drawing]]&\"*\"","v":"*405755-0004*"}]
[null,2,405756000401,"CM04","405756-0004","CAM, LH","D17D/D30D FB","DOWA","PCS","01DWA",400,{"$f":"\"*\"&Table2[[#This Row],[Part No Drawing]]&\"*\"","v":"*405756-0004*"}]
[null,3,406115002001,"HK01","406115-0020","HOOK, RH","D17D/D30D FB","DOWA","PCS","01DWA",120,{"$f":"\"*\"&Table2[[#This Row],[Part No Drawing]]&\"*\"","v":"*406115-0020*"}]
[null,4,406116001901,"HK02","406116-0019","HOOK, LH","D17D/D30D FB","DOWA","PCS","01DWA",120,{"$f":"\"*\"&Table2[[#This Row],[Part No Drawing]]&\"*\"","v":"*406116-0019*"}]
[null,5,406455001501,"PW03","406455-0015","PAWL, RH","D17D/D30D FB","DOWA","PCS","01DWA",300,{"$f":"\"*\"&Table2[[#This Row],[Part No Drawing]]&\"*\"","v":"*406455-0015*"}]
[null,6,406456001301,"PW04","406456-0013","PAWL, LH","D17D/D30D FB","DOWA","PCS","01DWA",300,{"$f":"\"*\"&Table2[[#This Row],[Part No Drawing]]&\"*\"","v":"*406456-0013*"}]
[null,7,4057550007,"CM05","405755-0007","CAM RH D14N","D14N FLOOR LOCK","DOWA","PCS","01DWA",400,{"$f":"\"*\"&Table2[[#This Row],[Part No Drawing]]&\"*\"","v":"*405755-0007*"}]
[null,8,4057560006,"CM06","405756-0006","CAM LH D14N","D14N FLOOR LOCK","DOWA","PCS","01DWA",400,{"$f":"\"*\"&Table2[[#This Row],[Part No Drawing]]&\"*\"","v":"*405756-0006*"}]
[null,9,4057150048,"RT01","405715-0048","RATCHET,REC ADJ, RH","YR9 RR REC","DOWA.","PCS","02DWA",50,{"$f":"\"*\"&Table2[[#This Row],[Part No Drawing]]&\"*\"","v":"*405715-0048*"}]
[null,10,4057160051,"RT02","405716-0051","RATCHET,REC ADJ, LH","YR9 RR REC","DOWA.","PCS","02DWA",50,{"$f":"\"*\"&Table2[[#This Row],[Part No Drawing]]&\"*\"","v":"*405716-0051*"}]
[null,1,26414,"B001MT","SPH440-OD (2.6 X 414)","COIL RELEASE ARM RH/LH ","YL8/YR9 FR REC","STEEL CENTER","KG","01SCI",1854,{"$f":"\"*\"&Table2[[#This Row],[Part No Drawing]]&\"*\"","v":"*SPH440-OD (2.6 X 414)*"}]
[null,2,18292,"B002MT","SPH590-OD (1.8 X 292)","COIL LOWER ARM RH/LH","YL8/YR9 FR REC","STEEL CENTER","KG","01SCI",1308,{"$f":"\"*\"&Table2[[#This Row],[Part No Drawing]]&\"*\"","v":"*SPH590-OD (1.8 X 292)*"}]
[null,3,26318,"B003MT","SAPH440-P (2.6 X 318)","COIL BASE REC RH/LH (KOBE)","YL8 3RD REC","STEEL CENTER","KG","01SCI",1237,{"$f":"\"*\"&Table2[[#This Row],[Part No Drawing]]&\"*\"","v":"*SAPH440-P (2.6 X 318)*"}]
[null,4,26225,"B004MT","SPFH590-P (2.6 X 225)","COIL BASE REC OUTSIDE RH/LH","YL8 3RD REC","STEEL CENTER","KG","01SCI",1008,{"$f":"\"*\"&Table2[[#This Row],[Part No Drawing]]&\"*\"","v":"*SPFH590-P (2.6 X 225)*"}]
[null,5,20292,"B010MT","SPFH590-P (2.0 X 292)","COIL LEVER RH/LH ","D17D FLOOR LOCK","STEEL CENTER","KG","01SCI",1136,{"$f":"\"*\"&Table2[[#This Row],[Part No Drawing]]&\"*\"","v":"*SPFH590-P (2.0 X 292)*"}]
[null,6,26238,"B011MT","SPFH590-P (2.6 X 238)","COIL PLATE INTERLOCK RH/LH","D17D FLOOR LOCK","STEEL CENTER","KG","01SCI",1368,{"$f":"\"*\"&Table2[[#This Row],[Part No Drawing]]&\"*\"","v":"*SPFH590-P (2.6 X 238)*"}]
[null,7,20286,"B015MT","SAPH440 (2.0 X 286)","COIL ADJUSTER LOWER ARM RH/LH","TSAA FR REC","STEEL CENTER","KG","01SCI",1113,{"$f":"\"*\"&Table2[[#This Row],[Part No Drawing]]&\"*\"","v":"*SAPH440 (2.0 X 286)*"}]
[null,8,23126,"B016MT","SAPH440 (2.3 X 126)","COIL HOOK SPRING LOWER RH/LH","TSAA FR REC","STEEL CENTER","KG","01SCI",290,{"$f":"\"*\"&Table2[[#This Row],[Part No Drawing]]&\"*\"","v":"*SAPH440 (2.3 X 126)*"}]
[null,9,23363,"B017MT","SAPH440 (2.3 X 363)","COIL RELEASE ARM OUTER RH/LH","TSAA FR REC","STEEL CENTER","KG","01SCI",1412,{"$f":"\"*\"&Table2[[#This Row],[Part No Drawing]]&\"*\"","v":"*SAPH440 (2.3 X 363)*"}]
[null,10,2695,"B021MT","SPH590 (2.6 X 95)","COIL CAM RH/LH FINE BLANKING","D17D/D30D FLOOR LOCK (FINE BLANKING)","STEEL CENTER","KG","01SCI",316,{"$f":"\"*\"&Table2[[#This Row],[Part No Drawing]]&\"*\"","v":"*SPH590 (2.6 X 95)*"}]
[null,11,45136,"B022MT","S28CB (4.5 X 136)","COIL HOOK RH/LH FINE BLANKING","D17D/D30D FLOOR LOCK (FINE BLANKING)","STEEL CENTER","KG","01SCI",609,{"$f":"\"*\"&Table2[[#This Row],[Part No Drawing]]&\"*\"","v":"*S28CB (4.5 X 136)*"}]
[null,12,45123,"B023MT","S28CB (4.5 X 123)","COIL PAWL RH/LH FINE BLANKING","D17D/D30D FLOOR LOCK (FINE BLANKING)","STEEL CENTER","KG","01SCI",551,{"$f":"\"*\"&Table2[[#This Row],[Part No Drawing]]&\"*\"","v":"*S28CB (4.5 X 123)*"}]
[null,13,26254,"B026MT","SPFH590-P (2.6 X 254)","COIL PLATE INTERLOCK RH3/LH2","D30D FLOOR LOCK","STEEL CENTER","KG","01SCI",988,{"$f":"\"*\"&Table2[[#This Row],[Part No Drawing]]&\"*\"","v":"*SPFH590-P (2.6 X 254)*"}]
[null,14,26236,"B027MT","SPFH590-P (2.6 X 236)","COIL PLATE INTERLOCK RH4","D30D FLOOR LOCK","STEEL CENTER","KG","01SCI",918,{"$f":"\"*\"&Table2[[#This Row],[Part No Drawing]]&\"*\"","v":"*SPFH590-P (2.6 X 236)*"}]
[null,15,23514,"B028MT","SAPH440 (2.3 X 514)","FR LEG BRKT REAR OUT","4L45W FR SEAT TRACK","STEEL CENTER","KG","01SCI",2303,{"$f":"\"*\"&Table2[[#This Row],[Part No Drawing]]&\"*\"","v":"*SAPH440 (2.3 X 514)*"}]
[null,16,23116,"B029MT","SAPH440 (2.3X116)","FR LEG BRKT LEG REAR INNER","4L45W FR SEAT TRACK","STEEL CENTER","KG","01SCI",386,{"$f":"\"*\"&Table2[[#This Row],[Part No Drawing]]&\"*\"","v":"*SAPH440 (2.3X116)*"}]
[null,17,20461,"B030MT","SAPH440 (2.0 X 461)","FRONT LEG BKT FRONT OUT & INN RH/LH ","4L45W FR SEAT TRACK","STEEL CENTER","KG","01SCI",2065,{"$f":"\"*\"&Table2[[#This Row],[Part No Drawing]]&\"*\"","v":"*SAPH440 (2.0 X 461)*"}]
[null,18,16250,"B031MT","SPFC590 (1.6 X 250)","HANDLE SUPPORT BRKT","4L45W FR SEAT TRACK","STEEL CENTER","KG","01SCI",1120,{"$f":"\"*\"&Table2[[#This Row],[Part No Drawing]]&\"*\"","v":"*SPFC590 (1.6 X 250)*"}]
[null,19,14391,"B032MT","SPFC980Y (1.4 X 391)","FR LOWER RAIL OUTER","4L45W FR SEAT TRACK","STEEL CENTER","KG","01SCI",1751,{"$f":"\"*\"&Table2[[#This Row],[Part No Drawing]]&\"*\"","v":"*SPFC980Y (1.4 X 391)*"}]
[null,20,14400,"B034MT","SPFC980Y (1.4 X 400)","FR UPPER RAIL","4L45W FR SEAT TRACK","STEEL CENTER","KG","01SCI",1792,{"$f":"\"*\"&Table2[[#This Row],[Part No Drawing]]&\"*\"","v":"*SPFC980Y (1.4 X 400)*"}]
[null,21,14436,"B033MT","SPFC980Y (1.4 X 436)","FR LOWER RAIL INNER","4L45W FR SEAT TRACK","STEEL CENTER","KG","01SCI",1953,{"$f":"\"*\"&Table2[[#This Row],[Part No Drawing]]&\"*\"","v":"*SPFC980Y (1.4 X 436)*"}]
[null,22,20134,"B035MT","SPFC980Y (2.0 X 134)","REINFORCE BRKT FRONT INNER","4L45W FR SEAT TRACK","STEEL CENTER","KG","01SCI",446,{"$f":"\"*\"&Table2[[#This Row],[Part No Drawing]]&\"*\"","v":"*SPFC980Y (2.0 X 134)*"}]
[null,23,2695,"B036MT","SPFH590 (2.6 X 195)","RR LOWER BRKT INN RH","4L45W 2ND SEAT TRACK","STEEL CENTER","KG","01SCI",649,{"$f":"\"*\"&Table2[[#This Row],[Part No Drawing]]&\"*\"","v":"*SPFH590 (2.6 X 195)*"}]
[null,24,14371,"B037MT","SPFC980Y (1.4 X 371)","RR UPPER RAIL","4L45W 2ND SEAT TRACK","STEEL CENTER","KG","01SCI",1662,{"$f":"\"*\"&Table2[[#This Row],[Part No Drawing]]&\"*\"","v":"*SPFC980Y (1.4 X 371)*"}]
[null,25,16412,"B038MT","SPFC980Y (1.6 X 412)","RR LOWER RAIL OUT/INN","4L45W 2ND SEAT TRACK","STEEL CENTER","KG","01SCI",1845,{"$f":"\"*\"&Table2[[#This Row],[Part No Drawing]]&\"*\"","v":"*SPFC980Y (1.6 X 412)*"}]
[null,26,26171,"B039MT","SPFH590 (2.6 X 171)","RR LOWER BRKT INN LH","4L45W 2ND SEAT TRACK","STEEL CENTER","KG","01SCI",569,{"$f":"\"*\"&Table2[[#This Row],[Part No Drawing]]&\"*\"","v":"*SPFH590 (2.6 X 171)*"}]
[null,27,23177,"B042MT","SAPH440 (2.3 X 177)","LOWER HOOK RH/LH","4L45W 2ND SEAT TRACK","STEEL CENTER","KG","01SCI",589,{"$f":"\"*\"&Table2[[#This Row],[Part No Drawing]]&\"*\"","v":"*SAPH440 (2.3 X 177)*"}]
[null,28,26378,"B040MT","SAPH440 (2.6 X 378)","RELEASE ARM RH/LH","4L45W FR REC","STEEL CENTER","KG","01SCI",1693,{"$f":"\"*\"&Table2[[#This Row],[Part No Drawing]]&\"*\"","v":"*SAPH440 (2.6 X 378)*"}]
[null,29,23259,"B041MT","SPFH590 (2.3 X 259)","FR LOWER ARM RH/LH","4L45W FR REC","STEEL CENTER","KG","01SCI",1160,{"$f":"\"*\"&Table2[[#This Row],[Part No Drawing]]&\"*\"","v":"*SPFH590 (2.3 X 259)*"}]
[null,30,32178,"B043MT","SPFH590 (3.2 X 178)","2ND LOWER ARM RH","4L45W 2ND REC","STEEL CENTER","KG","01SCI",593,{"$f":"\"*\"&Table2[[#This Row],[Part No Drawing]]&\"*\"","v":"*SPFH590 (3.2 X 178)*"}]
[null,31,29180,"B044MT","SPFH590 (2.9 X 180)","2ND LOWER ARM LH","4L45W 2ND REC","STEEL CENTER","KG","01SCI",599,{"$f":"\"*\"&Table2[[#This Row],[Part No Drawing]]&\"*\"","v":"*SPFH590 (2.9 X 180)*"}]
[null,32,23300,"B045MT","SPFH590 (2.3 X 300)","ARM REST LOWER ARM","4L45W 2ND REC","STEEL CENTER","KG","01SCI",1344,{"$f":"\"*\"&Table2[[#This Row],[Part No Drawing]]&\"*\"","v":"*SPFH590 (2.3 X 300)*"}]
[null,33,26308,"B046MT","SPFH590 (2.6 X 308)","3RD LOWER ARM","4L45W 3RD REC","STEEL CENTER","KG","01SCI",1380,{"$f":"\"*\"&Table2[[#This Row],[Part No Drawing]]&\"*\"","v":"*SPFH590 (2.6 X 308)*"}]
[null,34,32125,"B047MT","S22CB (3.2 X 125)","CAM, RECLINING, RH/LH","SMALL REC","STEEL CENTER","KG","01SCI",416,{"$f":"\"*\"&Table2[[#This Row],[Part No Drawing]]&\"*\"","v":"*S22CB (3.2 X 125)*"}]
[null,35,37691,"B048MT","S22CB (3.7 X 69.1)","ARM, RECLINING ADJUSTER LOWER","SMALL REC","STEEL CENTER","KG","01SCI",230,{"$f":"\"*\"&Table2[[#This Row],[Part No Drawing]]&\"*\"","v":"*S22CB (3.7 X 69.1)*"}]
[null,36,40639,"B049MT","S28CB (4.0 X 63.9)","RATCHET, RECLINING ADJUSTER","SMALL REC","STEEL CENTER","KG","01SCI",212,{"$f":"\"*\"&Table2[[#This Row],[Part No Drawing]]&\"*\"","v":"*S28CB (4.0 X 63.9)*"}]
[null,37,2060,"B050MT","SPC270E (2.0 X 60)","SPACER, RECLINING RATCHET","SMALL REC","STEEL CENTER","KG","01SCI",199,{"$f":"\"*\"&Table2[[#This Row],[Part No Drawing]]&\"*\"","v":"*SPC270E (2.0 X 60)*"}]
[null,38,1484,"B051MT","SPC440 (1.4 X 84)","PLATE, RECLINING ADJUSTER LOWER ARM","SMALL REC","STEEL CENTER","KG","01SCI",279,{"$f":"\"*\"&Table2[[#This Row],[Part No Drawing]]&\"*\"","v":"*SPC440 (1.4 X 84)*"}]
[null,39,2693,"B052MT","SPH590 (2.6 X 93)","CAM SEAT TRACK, RH/LH","D14N FLOOR LOCK","STEEL CENTER","KG","01SCI",309,{"$f":"\"*\"&Table2[[#This Row],[Part No Drawing]]&\"*\"","v":"*SPH590 (2.6 X 93)*"}]
[null,40,26227,"B053MT","SPFH590-OD (2.6 X 227)","PLATE, INTERLOCK, RH/LH 3rd","D14N FLOOR LOCK","STEEL CENTER","KG","01SCI",1017,{"$f":"\"*\"&Table2[[#This Row],[Part No Drawing]]&\"*\"","v":"*SPFH590-OD (2.6 X 227)*"}]
[null,41,26245,"B054MT","SPFH590-OD (2.6 X 245)","PLATE, INTERLOCK, RH/LH 2nd","D14N FLOOR LOCK","STEEL CENTER","KG","01SCI",1097,{"$f":"\"*\"&Table2[[#This Row],[Part No Drawing]]&\"*\"","v":"*SPFH590-OD (2.6 X 245)*"}]
[null,42,16434,"A011MT","SPH440 (1.6 X 434)","LIFT ARM YHA","YHA REGULATOR","STEEL CENTER","KG","01SCI",1944,{"$f":"\"*\"&Table2[[#This Row],[Part No Drawing]]&\"*\"","v":"*SPH440 (1.6 X 434)*"}]
[null,43,20164,"A012MT","SPH590 (2.0 X 164)","DRIVEN GEAR YHA","YHA REGULATOR","STEEL CENTER","KG","01SCI",546,{"$f":"\"*\"&Table2[[#This Row],[Part No Drawing]]&\"*\"","v":"*SPH590 (2.0 X 164)*"}]
[null,44,10225,"A013MT","SGCD1 Z12 (1.0 X 225)","BASE PLATE YHA","YHA REGULATOR","STEEL CENTER","KG","01SCI",1008,{"$f":"\"*\"&Table2[[#This Row],[Part No Drawing]]&\"*\"","v":"*SGCD1 Z12 (1.0 X 225)*"}]
[null,45,16196,"A014MT","SGC440 Z12 (1.6 X 196)","EQUALIZER ARM YHA","YHA REGULATOR","STEEL CENTER","KG","01SCI",653,{"$f":"\"*\"&Table2[[#This Row],[Part No Drawing]]&\"*\"","v":"*SGC440 Z12 (1.6 X 196)*"}]
[null,46,10452,"A015MT","SGCD1 Z12 (1.0 X 452)","LIFT ARM BRACKET YHA","YHA REGULATOR","STEEL CENTER","KG","01SCI",2025,{"$f":"\"*\"&Table2[[#This Row],[Part No Drawing]]&\"*\"","v":"*SGCD1 Z12 (1.0 X 452)*"}]
[null,1,14445,"A001MT","SPC440 (1.4x445)","F/M LIFT ARM COIL","810 REG","TT METALS INDONESIA","KG","01TTI",2035,{"$f":"\"*\"&Table2[[#This Row],[Part No Drawing]]&\"*\"","v":"*SPC440 (1.4x445)*"}]
[null,2,16460,"A002MT","SPH 440-OD (1.6x460)","R/M LIFT ARM COIL","810 REG","TT METALS INDONESIA","KG","01TTI",2103,{"$f":"\"*\"&Table2[[#This Row],[Part No Drawing]]&\"*\"","v":"*SPH 440-OD (1.6x460)*"}]
[null,3,14451,"A003MT","SPC 440 (1.4x451)","F/P LIFT ARM COIL","810 & 650/660 & 800 REG","TT METALS INDONESIA","KG","01TTI",1862,{"$f":"\"*\"&Table2[[#This Row],[Part No Drawing]]&\"*\"","v":"*SPC 440 (1.4x451)*"}]
[null,4,14376,"A004MT","SGCC (1.4x376)","F/P BLANK BASE PLATE COIL","810 & 650/660 & 800 REG","TT METALS INDONESIA","KG","01TTI",1719,{"$f":"\"*\"&Table2[[#This Row],[Part No Drawing]]&\"*\"","v":"*SGCC (1.4x376)*"}]
[null,5,12368,"A005MT","SGCC (1.2x368)","R/P BLANK BASE PLATE COIL","810 & 650/660 & 800 REG","TT METALS INDONESIA","KG","01TTI",1682,{"$f":"\"*\"&Table2[[#This Row],[Part No Drawing]]&\"*\"","v":"*SGCC (1.2x368)*"}]
[null,6,16448,"A006MT","SPH 440-OD (1.6x448)","R/P LIFT ARM COIL","810 REG","TT METALS INDONESIA","KG","01TTI",2048,{"$f":"\"*\"&Table2[[#This Row],[Part No Drawing]]&\"*\"","v":"*SPH 440-OD (1.6x448)*"}]
[null,7,10224,"A007MT","SGCC (1.0x224)","EQUALIZER ARM BRACKET COIL","810 & 650/660 REG","TT METALS INDONESIA","KG","01TTI",1024,{"$f":"\"*\"&Table2[[#This Row],[Part No Drawing]]&\"*\"","v":"*SGCC (1.0x224)*"}]
[null,8,16461,"A008MT","SPH440-OD (1.6 X 461)","COIL R/P LIFT ARM","650/660 REG","TT METALS INDONESIA","KG","01TTI",2108,{"$f":"\"*\"&Table2[[#This Row],[Part No Drawing]]&\"*\"","v":"*SPH440-OD (1.6 X 461)*"}]
[null,9,29188,"A009MT","SPH780-OD (2.9 X 188)","COIL F/P DRIVEN GEAR","650/660 & 800 REG","TT METALS INDONESIA","KG","01TTI",860,{"$f":"\"*\"&Table2[[#This Row],[Part No Drawing]]&\"*\"","v":"*SPH780-OD (2.9 X 188)*"}]
[null,10,29164,"A010MT","SPH780-OD (2.9 X 164)","COIL R/P DRIVEN GEAR","650/660 & 800 REG","TT METALS INDONESIA","KG","01TTI",750,{"$f":"\"*\"&Table2[[#This Row],[Part No Drawing]]&\"*\"","v":"*SPH780-OD (2.9 X 164)*"}]
[null,11,1686,"B005MT","SPC590 (1.6 X 86)","COIL BKT LOCK LEVER #1 , FR","660 Lock Lever","TT METALS INDONESIA","KG","01TTI",393,{"$f":"\"*\"&Table2[[#This Row],[Part No Drawing]]&\"*\"","v":"*SPC590 (1.6 X 86)*"}]
[null,12,16230,"B006MT","SPC590 (1.6 X 230)","COIL BKT LOCK LEVER #2 , FR","660 Lock Lever","TT METALS INDONESIA","KG","01TTI",1052,{"$f":"\"*\"&Table2[[#This Row],[Part No Drawing]]&\"*\"","v":"*SPC590 (1.6 X 230)*"}]
[null,13,1896,"B007MT","SPH590-OD (1.8 X 96)","COIL BKT LOCK LEVER #1 , RR","660 Lock Lever","TT METALS INDONESIA","KG","01TTI",439,{"$f":"\"*\"&Table2[[#This Row],[Part No Drawing]]&\"*\"","v":"*SPH590-OD (1.8 X 96)*"}]
[null,14,18230,"B008MT","SPH590-OD (1.8 X 230)","COIL BKT LOCK LEVER #2 , RR","660 Lock Lever","TT METALS INDONESIA","KG","01TTI",1052,{"$f":"\"*\"&Table2[[#This Row],[Part No Drawing]]&\"*\"","v":"*SPH590-OD (1.8 X 230)*"}]
[null,15,2690,"B009MT","SPH590-OD (2.6 X 90)","COIL LOCK LEVER INNER, RR","660 Lock Lever","TT METALS INDONESIA","KG","01TTI",411,{"$f":"\"*\"&Table2[[#This Row],[Part No Drawing]]&\"*\"","v":"*SPH590-OD (2.6 X 90)*"}]
[null,16,18155,"B012MT","SPC980DU (1.8 X 155)","COIL LOCK LEVER INNER, FR","660 Lock Lever","TT METALS INDONESIA","KG","01TTI",709,{"$f":"\"*\"&Table2[[#This Row],[Part No Drawing]]&\"*\"","v":"*SPC980DU (1.8 X 155)*"}]
[null,17,20405,"B018MT","SPH590-OD (2.0 X 405)","BASE, INTER LOCK INSIDE, RH/LH","800 SEAT LOCK","TT METALS INDONESIA","KG","01TTI",1852,{"$f":"\"*\"&Table2[[#This Row],[Part No Drawing]]&\"*\"","v":"*SPH590-OD (2.0 X 405)*"}]
[null,18,20410,"B019MT","SPH590-OD (2.0 X 410)","BASE, INTER LOCK OUTSIDE, RH/LH","800 SEAT LOCK","TT METALS INDONESIA","KG","01TTI",1875,{"$f":"\"*\"&Table2[[#This Row],[Part No Drawing]]&\"*\"","v":"*SPH590-OD (2.0 X 410)*"}]
[null,19,20488,"B020MT","SPH590-OD (2.0 X 488)","LINK, INTER LOCK OUTER RH/LH","800 SEAT LOCK","TT METALS INDONESIA","KG","01TTI",1931,{"$f":"\"*\"&Table2[[#This Row],[Part No Drawing]]&\"*\"","v":"*SPH590-OD (2.0 X 488)*"}]
[null,20,2088,"B024MT","SPH440 (2.0 X 88)","PLATE, INTER LOCK, RH/LH","800 SEAT LOCK","TT METALS INDONESIA","KG","01TTI",427,{"$f":"\"*\"&Table2[[#This Row],[Part No Drawing]]&\"*\"","v":"*SPH440 (2.0 X 88)*"}]
[null,21,23136,"B025MT","SPH440 (2.3 X 136)","PLATE, INTER LOCK, RH/LH","800 SEAT LOCK","TT METALS INDONESIA","KG","01TTI",422,{"$f":"\"*\"&Table2[[#This Row],[Part No Drawing]]&\"*\"","v":"*SPH440 (2.3 X 136)*"}]
[null,22,14326,"C001MT","SPC440 (1.4 X 326)","PLATE, SLIDE DOOR LOCK UPPER RH/LH","800 SLIDE DOOR LOCK","TT METALS INDONESIA","KG","01TTI",767,{"$f":"\"*\"&Table2[[#This Row],[Part No Drawing]]&\"*\"","v":"*SPC440 (1.4 X 326)*"}]
[null,23,12130,"C002MT","SPC440 (1.2 X 130)","PLATE LOWER RH/LH","800 SLIDE DOOR LOCK","TT METALS INDONESIA","KG","01TTI",275,{"$f":"\"*\"&Table2[[#This Row],[Part No Drawing]]&\"*\"","v":"*SPC440 (1.2 X 130)*"}]
[null,24,32109,"C003MT","SPH370 (3.2 X 109)","RATCHET, SLIDE DOOR LOCK, RH/LH","800 SLIDE DOOR LOCK","TT METALS INDONESIA","KG","01TTI",498,{"$f":"\"*\"&Table2[[#This Row],[Part No Drawing]]&\"*\"","v":"*SPH370 (3.2 X 109)*"}]
[null,1,"ARC02","ARC02","ARC02","MIXED GAS CYLINDER","COMMON LINE","SHINTO WELDING","CYLINDER","01SWG",1,{"$f":"\"*\"&Table2[[#This Row],[Part No Drawing]]&\"*\"","v":"*ARC02*"}]
[null,1,4038670008,"RB05","403867-0008","BRACKET SEAT TRACK LOWER OUTER","4L45W","ITO SEISAKUSHO","PCS","01ITO",60,{"$f":"\"*\"&Table2[[#This Row],[Part No Drawing]]&\"*\"","v":"*403867-0008*"}]
[null,2,4038670009,"RB08","403867-0009","BRACKET, SEAT TRACK LOWER OUTER","4L45W","ITO SEISAKUSHO","PCS","01ITO",80,{"$f":"\"*\"&Table2[[#This Row],[Part No Drawing]]&\"*\"","v":"*403867-0009*"}]
[null,3,4038680007,"RB09","403868-0007","BRACKET, SEAT TRACK LOWER INNER","4L45W","ITO SEISAKUSHO","PCS","01ITO",70,{"$f":"\"*\"&Table2[[#This Row],[Part No Drawing]]&\"*\"","v":"*403868-0007*"}]
[null,4,4035480004,"BK08","403548-0004","BRACKET, UPPER RAIL INNER","4L45W","ITO SEISAKUSHO","PCS","01ITO",60,{"$f":"\"*\"&Table2[[#This Row],[Part No Drawing]]&\"*\"","v":"*403548-0004*"}]
[null,5,4037580007,"BK07","403758-0007","BRACKET, SEAT TRACK UPPER RAIL FR INNER","4L45W","ITO SEISAKUSHO","PCS","01ITO",800,{"$f":"\"*\"&Table2[[#This Row],[Part No Drawing]]&\"*\"","v":"*403758-0007*"}]
[null,6,4084590212,"WA04","408459-0212","SPACER","4L45W","ITO SEISAKUSHO","PCS","01ITO",450,{"$f":"\"*\"&Table2[[#This Row],[Part No Drawing]]&\"*\"","v":"*408459-0212*"}]
[null,7,4084590213,"WA05","408459-0213","SPACER","4L45W","ITO SEISAKUSHO","PCS","01ITO",500,{"$f":"\"*\"&Table2[[#This Row],[Part No Drawing]]&\"*\"","v":"*408459-0213*"}]
[null,1,8006000026,"PU01","800600-0026","PUSH NUT","4L45W","FC TECH","PCS","01FCT",10000,{"$f":"\"*\"&Table2[[#This Row],[Part No Drawing]]&\"*\"","v":"*800600-0026*"}]
[null,2,8022100004,"RG01","802210-0004","RING, E","YHA SEAT TRACK","FC TECH","PCS","01FCT",10000,{"$f":"\"*\"&Table2[[#This Row],[Part No Drawing]]&\"*\"","v":"*802210-0004*"}]
[null,1,"451605-0005","B041","451605-0005","BRAKE S/A VERTICAL ADJUSTER FR RH ","COMMON","NTN","PCS","01NTN",30,{"$f":"\"*\"&Table2[[#This Row],[Part No Drawing]]&\"*\"","v":"*451605-0005*"}]
[null,2,"451606-0003","B042","451606-0003","BRAKE S/A VERTICAL ADJUSTER FR LH","COMMON","NTN","PCS","01NTN",30,{"$f":"\"*\"&Table2[[#This Row],[Part No Drawing]]&\"*\"","v":"*451606-0003*"}]
[null,1,"8614674P60","BU09","86146-74P60","BUSH METAL","YHA BUSH STAKING","SAINT GOBAIN","PCS","01SGN",1,{"$f":"\"*\"&Table2[[#This Row],[Part No Drawing]]&\"*\"","v":"*86146-74P60*"}]
[null,2,"8614574P60","BU08","86145-74P60","BUSH","YHA BUSH STAKING","SAINT GOBAIN","PCS","01SGN",1,{"$f":"\"*\"&Table2[[#This Row],[Part No Drawing]]&\"*\"","v":"*86145-74P60*"}]
[null,1,"8614474P60","PL24","86144-74P60","LINK, VERTICAL TRAVEL FRONT","YHA BUSH STAKING","INTI POLYMETAL","PCS","01IPM",1,{"$f":"\"*\"&Table2[[#This Row],[Part No Drawing]]&\"*\"","v":"*86144-74P60*"}]
[null,1,"8601573R00","PL23S","86015-73R00","LINK, SUB-ASSY, VERTICAL REAR","YHA BUSH STAKING","SUMMIT ADYAWINSA","PCS","01SAI",1,{"$f":"\"*\"&Table2[[#This Row],[Part No Drawing]]&\"*\"","v":"*86015-73R00*"}]

{"sheet":"QR CODE ASMO","index":1,"n_rows":29,"n_cols":4,"rows_kept":29,"cut":false,"hidden":true,"merged":[[0,0,1,2]]}
["SHIROKI INDONESIA"]
[]
["NO.","SID NO","QR CODE NO","ID"]
[1,"MO01",null,1]
[2,"MO02",null,2]
[3,"MO03",null,3]
[4,"MO05",null,4]
[5,"MO07",null,5]
[6,"MO08",null,6]
[7,"MO09",null,7]
[8,"MO10",null,8]
[9,"MO11",null,9]
[10,"MO12",null,10]
[11,"MO13",null,11]
[12,"MO16",null,12]
[13,"MO18",null,13]
[14,"MO14",null,14]
[15,"MO15",null,15]
[16,"MO17",null,16]
[17,"MO19",null,17]
[18,"MO21",null,18]
[19,"MO20",null,19]
[20,"MO04",null,20]
[21,"MO06",null,21]
[20,"MO31",null,22]
[21,"MO27",null,23]
[22,"MO28",null,24]
[23,"MO29",null,25]
[24,"MO30",null,26]

{"sheet":"Card Template","index":2,"n_rows":20,"n_cols":54,"rows_kept":20,"cut":false,"hidden":false,"merged":[[2,41,6,52],[2,15,4,39],[19,15,21,24],[7,2,14,13],[15,2,16,13],[17,2,21,13],[4,2,6,13],[2,2,3,13],[15,15,18,39],[11,15,14,39],[19,25,21,39],[15,41,16,52],[17,41,21,52],[7,41,14,52],[6,15,10,39]]}
[null,null,null,null,null,null,null,null,null,null,null,null,null,null,null,null,null,null,null,null,null,null,null,null,null,null,null,null,null,null,null,null,null,null,null,null,null,null,null,null,null,null,null,null,null,null,null,null,null,null,null,null,null,21]
[]
[null,null,"DN NO",null,null,null,null,null,null,null,null,null,null,null,null,"SHOPPING CARD",null,null,null,null,null,null,null,null,null,null,null,null,null,null,null,null,null,null,null,null,null,null,null,null,null,5]
[]
[null,null,"01FKI-ID-18-144-8-13-A"]
[]
[null,null,null,null,null,null,null,null,null,null,null,null,null,null,null,"*404594-0009*"]
[null,null,"2018-08-13",null,null,null,null,null,null,null,null,null,null,null,null,null,null,null,null,null,null,null,null,null,null,null,null,null,null,null,null,null,null,null,null,null,null,null,null,null,null,"hb03"]
[]
[]
[]
[null,null,null,null,null,null,null,null,null,null,null,null,null,null,null,"FRONT HARNESS BRKT INNER LH"]
[]
[]
[]
[null,null,"DARI à",null,null,null,null,null,null,null,null,null,null,null,null,"404594-0009",null,null,null,null,null,null,null,null,null,null,null,null,null,null,null,null,null,null,null,null,null,null,null,null,null,"SAMPAI KE à"]
[]
[null,null,"FUKUYAMA",null,null,null,null,null,null,null,null,null,null,null,null,null,null,null,null,null,null,null,null,null,null,null,null,null,null,null,null,null,null,null,null,null,null,null,null,null,null,"SHIROKI"]
[]
[null,null,null,null,null,null,null,null,null,null,null,null,null,null,null,"QTY/KANBAN",null,null,null,null,null,null,null,null,null,100]

{"sheet":"Print Template","index":3,"n_rows":0,"n_cols":0,"rows_kept":0,"cut":false,"hidden":true,"merged":[]}

{"sheet":"Data","index":4,"n_rows":103,"n_cols":13,"rows_kept":103,"cut":false,"hidden":false,"merged":[]}
[]
[]
[]
[null,"NO","DN TO SUPPLIER","DATE","SID NO","QTY ORDER (KBN)","QTY/BOX","TOTAL ORDER","PART NO","PART NAME","SUPPLIER","UNIQUE NO","SUPPLIER CODE"]
[null,1,"01FKI-ID-18-144-8-13-A","2018-08-13","BK11",1,{"$f":"IFERROR(VLOOKUP(E5,'Master Data'!$D$3:$K$292,8,0),\"\")","v":500},{"$f":"IFERROR(F5*G5,\"\")","v":500},{"$f":"IFERROR(VLOOKUP(E5,'Master Data'!$D$3:$E$292,2,0),\"\")","v":"403758-0004"},{"$f":"IFERROR(VLOOKUP(I5,'Master Data'!$E$3:$F$292,2,0),\"\")","v":"BRACKET, SEAT TRACK UPPER RAIL FR INNER"},{"$f":"IFERROR(VLOOKUP(I5,'Master Data'!$E$3:$H$292,4,0),\"\")","v":"FUKUYAMA"},{"$f":"IFERROR(VLOOKUP(E5,'Master Data'!D3:L292,9,0),\"\")","v":"*403758-0004*"},{"$f":"IFERROR(VLOOKUP(K5,'Master Data'!$H$3:$J$292,3,0),\"\")","v":"01FKI"}]
[null,2,"01FKI-ID-18-144-8-13-A","2018-08-13","B025",3,{"$f":"IFERROR(VLOOKUP(E6,'Master Data'!$D$3:$K$292,8,0),\"\")","v":24},{"$f":"IFERROR(F6*G6,\"\")","v":72},{"$f":"IFERROR(VLOOKUP(E6,'Master Data'!$D$3:$E$292,2,0),\"\")","v":"453209-0025"},{"$f":"IFERROR(VLOOKUP(I6,'Master Data'!$E$3:$F$292,2,0),\"\")","v":"YR9 HANDLE FR SEAT ADJUSTER"},{"$f":"IFERROR(VLOOKUP(I6,'Master Data'!$E$3:$H$292,4,0),\"\")","v":"FUKUYAMA"},{"$f":"IFERROR(VLOOKUP(E6,'Master Data'!D4:L293,9,0),\"\")","v":"*453209-0025*"},{"$f":"IFERROR(VLOOKUP(K6,'Master Data'!$H$3:$J$292,3,0),\"\")","v":"01FKI"}]
[null,3,"01FKI-ID-18-144-8-13-A","2018-08-13","hb02",4,{"$f":"IFERROR(VLOOKUP(E7,'Master Data'!$D$3:$K$292,8,0),\"\")","v":100},400,{"$f":"IFERROR(VLOOKUP(E7,'Master Data'!$D$3:$E$292,2,0),\"\")","v":"404593-0012"},{"$f":"IFERROR(VLOOKUP(I7,'Master Data'!$E$3:$F$292,2,0),\"\")","v":"FRONT HARNESS BRKT INNER RH"},{"$f":"IFERROR(VLOOKUP(I7,'Master Data'!$E$3:$H$292,4,0),\"\")","v":"FUKUYAMA"},{"$f":"IFERROR(VLOOKUP(E7,'Master Data'!D5:L294,9,0),\"\")","v":"*404593-0012*"},{"$f":"IFERROR(VLOOKUP(K7,'Master Data'!$H$3:$J$292,3,0),\"\")","v":"01FKI"}]
[null,4,"01FKI-ID-18-144-8-13-A","2018-08-13","hb03",5,{"$f":"IFERROR(VLOOKUP(E8,'Master Data'!$D$3:$K$292,8,0),\"\")","v":100},500,{"$f":"IFERROR(VLOOKUP(E8,'Master Data'!$D$3:$E$292,2,0),\"\")","v":"404594-0009"},{"$f":"IFERROR(VLOOKUP(I8,'Master Data'!$E$3:$F$292,2,0),\"\")","v":"FRONT HARNESS BRKT INNER LH"},{"$f":"IFERROR(VLOOKUP(I8,'Master Data'!$E$3:$H$292,4,0),\"\")","v":"FUKUYAMA"},{"$f":"IFERROR(VLOOKUP(E8,'Master Data'!D6:L295,9,0),\"\")","v":"*404594-0009*"},{"$f":"IFERROR(VLOOKUP(K8,'Master Data'!$H$3:$J$292,3,0),\"\")","v":"01FKI"}]
[null,5,null,null,null,null,{"$f":"IFERROR(VLOOKUP(E9,'Master Data'!$D$3:$K$292,8,0),\"\")","v":""},"",{"$f":"IFERROR(VLOOKUP(E9,'Master Data'!$D$3:$E$292,2,0),\"\")","v":""},{"$f":"IFERROR(VLOOKUP(I9,'Master Data'!$E$3:$F$292,2,0),\"\")","v":""},{"$f":"IFERROR(VLOOKUP(I9,'Master Data'!$E$3:$H$292,4,0),\"\")","v":""},{"$f":"IFERROR(VLOOKUP(E9,'Master Data'!D7:L296,9,0),\"\")","v":""},{"$f":"IFERROR(VLOOKUP(K9,'Master Data'!$H$3:$J$292,3,0),\"\")","v":""}]
[null,6,null,null,null,null,{"$f":"IFERROR(VLOOKUP(E10,'Master Data'!$D$3:$K$292,8,0),\"\")","v":""},"",{"$f":"IFERROR(VLOOKUP(E10,'Master Data'!$D$3:$E$292,2,0),\"\")","v":""},{"$f":"IFERROR(VLOOKUP(I10,'Master Data'!$E$3:$F$292,2,0),\"\")","v":""},{"$f":"IFERROR(VLOOKUP(I10,'Master Data'!$E$3:$H$292,4,0),\"\")","v":""},{"$f":"IFERROR(VLOOKUP(E10,'Master Data'!D8:L297,9,0),\"\")","v":""},{"$f":"IFERROR(VLOOKUP(K10,'Master Data'!$H$3:$J$292,3,0),\"\")","v":""}]
[null,7,null,null,null,null,{"$f":"IFERROR(VLOOKUP(E11,'Master Data'!$D$3:$K$292,8,0),\"\")","v":""},"",{"$f":"IFERROR(VLOOKUP(E11,'Master Data'!$D$3:$E$292,2,0),\"\")","v":""},{"$f":"IFERROR(VLOOKUP(I11,'Master Data'!$E$3:$F$292,2,0),\"\")","v":""},{"$f":"IFERROR(VLOOKUP(I11,'Master Data'!$E$3:$H$292,4,0),\"\")","v":""},{"$f":"IFERROR(VLOOKUP(E11,'Master Data'!D9:L298,9,0),\"\")","v":""},{"$f":"IFERROR(VLOOKUP(K11,'Master Data'!$H$3:$J$292,3,0),\"\")","v":""}]
[null,8,null,null,null,null,{"$f":"IFERROR(VLOOKUP(E12,'Master Data'!$D$3:$K$292,8,0),\"\")","v":""},"",{"$f":"IFERROR(VLOOKUP(E12,'Master Data'!$D$3:$E$292,2,0),\"\")","v":""},{"$f":"IFERROR(VLOOKUP(I12,'Master Data'!$E$3:$F$292,2,0),\"\")","v":""},{"$f":"IFERROR(VLOOKUP(I12,'Master Data'!$E$3:$H$292,4,0),\"\")","v":""},{"$f":"IFERROR(VLOOKUP(E12,'Master Data'!D10:L299,9,0),\"\")","v":""},{"$f":"IFERROR(VLOOKUP(K12,'Master Data'!$H$3:$J$292,3,0),\"\")","v":""}]
[null,9,null,null,null,null,{"$f":"IFERROR(VLOOKUP(E13,'Master Data'!$D$3:$K$292,8,0),\"\")","v":""},"",{"$f":"IFERROR(VLOOKUP(E13,'Master Data'!$D$3:$E$292,2,0),\"\")","v":""},{"$f":"IFERROR(VLOOKUP(I13,'Master Data'!$E$3:$F$292,2,0),\"\")","v":""},{"$f":"IFERROR(VLOOKUP(I13,'Master Data'!$E$3:$H$292,4,0),\"\")","v":""},{"$f":"IFERROR(VLOOKUP(E13,'Master Data'!D11:L300,9,0),\"\")","v":""},{"$f":"IFERROR(VLOOKUP(K13,'Master Data'!$H$3:$J$292,3,0),\"\")","v":""}]
[null,10,null,null,null,null,{"$f":"IFERROR(VLOOKUP(E14,'Master Data'!$D$3:$K$292,8,0),\"\")","v":""},"",{"$f":"IFERROR(VLOOKUP(E14,'Master Data'!$D$3:$E$292,2,0),\"\")","v":""},{"$f":"IFERROR(VLOOKUP(I14,'Master Data'!$E$3:$F$292,2,0),\"\")","v":""},{"$f":"IFERROR(VLOOKUP(I14,'Master Data'!$E$3:$H$292,4,0),\"\")","v":""},{"$f":"IFERROR(VLOOKUP(E14,'Master Data'!D12:L301,9,0),\"\")","v":""},{"$f":"IFERROR(VLOOKUP(K14,'Master Data'!$H$3:$J$292,3,0),\"\")","v":""}]
[null,11,null,null,null,null,{"$f":"IFERROR(VLOOKUP(E15,'Master Data'!$D$3:$K$292,8,0),\"\")","v":""},"",{"$f":"IFERROR(VLOOKUP(E15,'Master Data'!$D$3:$E$292,2,0),\"\")","v":""},{"$f":"IFERROR(VLOOKUP(I15,'Master Data'!$E$3:$F$292,2,0),\"\")","v":""},{"$f":"IFERROR(VLOOKUP(I15,'Master Data'!$E$3:$H$292,4,0),\"\")","v":""},{"$f":"IFERROR(VLOOKUP(E15,'Master Data'!D13:L302,9,0),\"\")","v":""},{"$f":"IFERROR(VLOOKUP(K15,'Master Data'!$H$3:$J$292,3,0),\"\")","v":""}]
[null,12,null,null,null,null,{"$f":"IFERROR(VLOOKUP(E16,'Master Data'!$D$3:$K$292,8,0),\"\")","v":""},"",{"$f":"IFERROR(VLOOKUP(E16,'Master Data'!$D$3:$E$292,2,0),\"\")","v":""},{"$f":"IFERROR(VLOOKUP(I16,'Master Data'!$E$3:$F$292,2,0),\"\")","v":""},{"$f":"IFERROR(VLOOKUP(I16,'Master Data'!$E$3:$H$292,4,0),\"\")","v":""},{"$f":"IFERROR(VLOOKUP(E16,'Master Data'!D14:L303,9,0),\"\")","v":""},{"$f":"IFERROR(VLOOKUP(K16,'Master Data'!$H$3:$J$292,3,0),\"\")","v":""}]
[null,13,null,null,null,null,{"$f":"IFERROR(VLOOKUP(E17,'Master Data'!$D$3:$K$292,8,0),\"\")","v":""},"",{"$f":"IFERROR(VLOOKUP(E17,'Master Data'!$D$3:$E$292,2,0),\"\")","v":""},{"$f":"IFERROR(VLOOKUP(I17,'Master Data'!$E$3:$F$292,2,0),\"\")","v":""},{"$f":"IFERROR(VLOOKUP(I17,'Master Data'!$E$3:$H$292,4,0),\"\")","v":""},{"$f":"IFERROR(VLOOKUP(E17,'Master Data'!D15:L304,9,0),\"\")","v":""},{"$f":"IFERROR(VLOOKUP(K17,'Master Data'!$H$3:$J$292,3,0),\"\")","v":""}]
[null,14,null,null,null,null,{"$f":"IFERROR(VLOOKUP(E18,'Master Data'!$D$3:$K$292,8,0),\"\")","v":""},"",{"$f":"IFERROR(VLOOKUP(E18,'Master Data'!$D$3:$E$292,2,0),\"\")","v":""},{"$f":"IFERROR(VLOOKUP(I18,'Master Data'!$E$3:$F$292,2,0),\"\")","v":""},{"$f":"IFERROR(VLOOKUP(I18,'Master Data'!$E$3:$H$292,4,0),\"\")","v":""},{"$f":"IFERROR(VLOOKUP(E18,'Master Data'!D16:L305,9,0),\"\")","v":""},{"$f":"IFERROR(VLOOKUP(K18,'Master Data'!$H$3:$J$292,3,0),\"\")","v":""}]
[null,15,null,null,null,null,{"$f":"IFERROR(VLOOKUP(E19,'Master Data'!$D$3:$K$292,8,0),\"\")","v":""},"",{"$f":"IFERROR(VLOOKUP(E19,'Master Data'!$D$3:$E$292,2,0),\"\")","v":""},{"$f":"IFERROR(VLOOKUP(I19,'Master Data'!$E$3:$F$292,2,0),\"\")","v":""},{"$f":"IFERROR(VLOOKUP(I19,'Master Data'!$E$3:$H$292,4,0),\"\")","v":""},{"$f":"IFERROR(VLOOKUP(E19,'Master Data'!D17:L306,9,0),\"\")","v":""},{"$f":"IFERROR(VLOOKUP(K19,'Master Data'!$H$3:$J$292,3,0),\"\")","v":""}]
[null,16,null,null,null,null,{"$f":"IFERROR(VLOOKUP(E20,'Master Data'!$D$3:$K$292,8,0),\"\")","v":""},"",{"$f":"IFERROR(VLOOKUP(E20,'Master Data'!$D$3:$E$292,2,0),\"\")","v":""},{"$f":"IFERROR(VLOOKUP(I20,'Master Data'!$E$3:$F$292,2,0),\"\")","v":""},{"$f":"IFERROR(VLOOKUP(I20,'Master Data'!$E$3:$H$292,4,0),\"\")","v":""},{"$f":"IFERROR(VLOOKUP(E20,'Master Data'!D18:L307,9,0),\"\")","v":""},{"$f":"IFERROR(VLOOKUP(K20,'Master Data'!$H$3:$J$292,3,0),\"\")","v":""}]
[null,17,null,null,null,null,{"$f":"IFERROR(VLOOKUP(E21,'Master Data'!$D$3:$K$292,8,0),\"\")","v":""},"",{"$f":"IFERROR(VLOOKUP(E21,'Master Data'!$D$3:$E$292,2,0),\"\")","v":""},{"$f":"IFERROR(VLOOKUP(I21,'Master Data'!$E$3:$F$292,2,0),\"\")","v":""},{"$f":"IFERROR(VLOOKUP(I21,'Master Data'!$E$3:$H$292,4,0),\"\")","v":""},{"$f":"IFERROR(VLOOKUP(E21,'Master Data'!D19:L308,9,0),\"\")","v":""},{"$f":"IFERROR(VLOOKUP(K21,'Master Data'!$H$3:$J$292,3,0),\"\")","v":""}]
[null,18,null,null,null,null,{"$f":"IFERROR(VLOOKUP(E22,'Master Data'!$D$3:$K$292,8,0),\"\")","v":""},"",{"$f":"IFERROR(VLOOKUP(E22,'Master Data'!$D$3:$E$292,2,0),\"\")","v":""},{"$f":"IFERROR(VLOOKUP(I22,'Master Data'!$E$3:$F$292,2,0),\"\")","v":""},{"$f":"IFERROR(VLOOKUP(I22,'Master Data'!$E$3:$H$292,4,0),\"\")","v":""},{"$f":"IFERROR(VLOOKUP(E22,'Master Data'!D20:L309,9,0),\"\")","v":""},{"$f":"IFERROR(VLOOKUP(K22,'Master Data'!$H$3:$J$292,3,0),\"\")","v":""}]
[null,19,null,null,null,null,{"$f":"IFERROR(VLOOKUP(E23,'Master Data'!$D$3:$K$292,8,0),\"\")","v":""},"",{"$f":"IFERROR(VLOOKUP(E23,'Master Data'!$D$3:$E$292,2,0),\"\")","v":""},{"$f":"IFERROR(VLOOKUP(I23,'Master Data'!$E$3:$F$292,2,0),\"\")","v":""},{"$f":"IFERROR(VLOOKUP(I23,'Master Data'!$E$3:$H$292,4,0),\"\")","v":""},{"$f":"IFERROR(VLOOKUP(E23,'Master Data'!D21:L310,9,0),\"\")","v":""},{"$f":"IFERROR(VLOOKUP(K23,'Master Data'!$H$3:$J$292,3,0),\"\")","v":""}]
[null,20,null,null,null,null,{"$f":"IFERROR(VLOOKUP(E24,'Master Data'!$D$3:$K$292,8,0),\"\")","v":""},"",{"$f":"IFERROR(VLOOKUP(E24,'Master Data'!$D$3:$E$292,2,0),\"\")","v":""},{"$f":"IFERROR(VLOOKUP(I24,'Master Data'!$E$3:$F$292,2,0),\"\")","v":""},{"$f":"IFERROR(VLOOKUP(I24,'Master Data'!$E$3:$H$292,4,0),\"\")","v":""},{"$f":"IFERROR(VLOOKUP(E24,'Master Data'!D22:L311,9,0),\"\")","v":""},{"$f":"IFERROR(VLOOKUP(K24,'Master Data'!$H$3:$J$292,3,0),\"\")","v":""}]
[null,21,null,null,null,null,{"$f":"IFERROR(VLOOKUP(E25,'Master Data'!$D$3:$K$292,8,0),\"\")","v":""},"",{"$f":"IFERROR(VLOOKUP(E25,'Master Data'!$D$3:$E$292,2,0),\"\")","v":""},{"$f":"IFERROR(VLOOKUP(I25,'Master Data'!$E$3:$F$292,2,0),\"\")","v":""},{"$f":"IFERROR(VLOOKUP(I25,'Master Data'!$E$3:$H$292,4,0),\"\")","v":""},{"$f":"IFERROR(VLOOKUP(E25,'Master Data'!D23:L312,9,0),\"\")","v":""},{"$f":"IFERROR(VLOOKUP(K25,'Master Data'!$H$3:$J$292,3,0),\"\")","v":""}]
[null,22,null,null,null,null,{"$f":"IFERROR(VLOOKUP(E26,'Master Data'!$D$3:$K$292,8,0),\"\")","v":""},"",{"$f":"IFERROR(VLOOKUP(E26,'Master Data'!$D$3:$E$292,2,0),\"\")","v":""},{"$f":"IFERROR(VLOOKUP(I26,'Master Data'!$E$3:$F$292,2,0),\"\")","v":""},{"$f":"IFERROR(VLOOKUP(I26,'Master Data'!$E$3:$H$292,4,0),\"\")","v":""},{"$f":"IFERROR(VLOOKUP(E26,'Master Data'!D24:L313,9,0),\"\")","v":""},{"$f":"IFERROR(VLOOKUP(K26,'Master Data'!$H$3:$J$292,3,0),\"\")","v":""}]
[null,23,null,null,null,null,{"$f":"IFERROR(VLOOKUP(E27,'Master Data'!$D$3:$K$292,8,0),\"\")","v":""},"",{"$f":"IFERROR(VLOOKUP(E27,'Master Data'!$D$3:$E$292,2,0),\"\")","v":""},{"$f":"IFERROR(VLOOKUP(I27,'Master Data'!$E$3:$F$292,2,0),\"\")","v":""},{"$f":"IFERROR(VLOOKUP(I27,'Master Data'!$E$3:$H$292,4,0),\"\")","v":""},{"$f":"IFERROR(VLOOKUP(E27,'Master Data'!D25:L314,9,0),\"\")","v":""},{"$f":"IFERROR(VLOOKUP(K27,'Master Data'!$H$3:$J$292,3,0),\"\")","v":""}]
[null,24,null,null,null,null,{"$f":"IFERROR(VLOOKUP(E28,'Master Data'!$D$3:$K$292,8,0),\"\")","v":""},"",{"$f":"IFERROR(VLOOKUP(E28,'Master Data'!$D$3:$E$292,2,0),\"\")","v":""},{"$f":"IFERROR(VLOOKUP(I28,'Master Data'!$E$3:$F$292,2,0),\"\")","v":""},{"$f":"IFERROR(VLOOKUP(I28,'Master Data'!$E$3:$H$292,4,0),\"\")","v":""},{"$f":"IFERROR(VLOOKUP(E28,'Master Data'!D26:L315,9,0),\"\")","v":""},{"$f":"IFERROR(VLOOKUP(K28,'Master Data'!$H$3:$J$292,3,0),\"\")","v":""}]
[null,25,null,null,null,null,{"$f":"IFERROR(VLOOKUP(E29,'Master Data'!$D$3:$K$292,8,0),\"\")","v":""},"",{"$f":"IFERROR(VLOOKUP(E29,'Master Data'!$D$3:$E$292,2,0),\"\")","v":""},{"$f":"IFERROR(VLOOKUP(I29,'Master Data'!$E$3:$F$292,2,0),\"\")","v":""},{"$f":"IFERROR(VLOOKUP(I29,'Master Data'!$E$3:$H$292,4,0),\"\")","v":""},{"$f":"IFERROR(VLOOKUP(E29,'Master Data'!D27:L316,9,0),\"\")","v":""},{"$f":"IFERROR(VLOOKUP(K29,'Master Data'!$H$3:$J$292,3,0),\"\")","v":""}]
[null,26,null,null,null,null,{"$f":"IFERROR(VLOOKUP(E30,'Master Data'!$D$3:$K$292,8,0),\"\")","v":""},"",{"$f":"IFERROR(VLOOKUP(E30,'Master Data'!$D$3:$E$292,2,0),\"\")","v":""},{"$f":"IFERROR(VLOOKUP(I30,'Master Data'!$E$3:$F$292,2,0),\"\")","v":""},{"$f":"IFERROR(VLOOKUP(I30,'Master Data'!$E$3:$H$292,4,0),\"\")","v":""},{"$f":"IFERROR(VLOOKUP(E30,'Master Data'!D28:L317,9,0),\"\")","v":""},{"$f":"IFERROR(VLOOKUP(K30,'Master Data'!$H$3:$J$292,3,0),\"\")","v":""}]
[null,27,null,null,null,null,{"$f":"IFERROR(VLOOKUP(E31,'Master Data'!$D$3:$K$292,8,0),\"\")","v":""},"",{"$f":"IFERROR(VLOOKUP(E31,'Master Data'!$D$3:$E$292,2,0),\"\")","v":""},{"$f":"IFERROR(VLOOKUP(I31,'Master Data'!$E$3:$F$292,2,0),\"\")","v":""},{"$f":"IFERROR(VLOOKUP(I31,'Master Data'!$E$3:$H$292,4,0),\"\")","v":""},{"$f":"IFERROR(VLOOKUP(E31,'Master Data'!D29:L318,9,0),\"\")","v":""},{"$f":"IFERROR(VLOOKUP(K31,'Master Data'!$H$3:$J$292,3,0),\"\")","v":""}]
[null,28,null,null,null,null,{"$f":"IFERROR(VLOOKUP(E32,'Master Data'!$D$3:$K$292,8,0),\"\")","v":""},"",{"$f":"IFERROR(VLOOKUP(E32,'Master Data'!$D$3:$E$292,2,0),\"\")","v":""},{"$f":"IFERROR(VLOOKUP(I32,'Master Data'!$E$3:$F$292,2,0),\"\")","v":""},{"$f":"IFERROR(VLOOKUP(I32,'Master Data'!$E$3:$H$292,4,0),\"\")","v":""},{"$f":"IFERROR(VLOOKUP(E32,'Master Data'!D30:L319,9,0),\"\")","v":""},{"$f":"IFERROR(VLOOKUP(K32,'Master Data'!$H$3:$J$292,3,0),\"\")","v":""}]
[null,29,null,null,null,null,{"$f":"IFERROR(VLOOKUP(E33,'Master Data'!$D$3:$K$292,8,0),\"\")","v":""},"",{"$f":"IFERROR(VLOOKUP(E33,'Master Data'!$D$3:$E$292,2,0),\"\")","v":""},{"$f":"IFERROR(VLOOKUP(I33,'Master Data'!$E$3:$F$292,2,0),\"\")","v":""},{"$f":"IFERROR(VLOOKUP(I33,'Master Data'!$E$3:$H$292,4,0),\"\")","v":""},{"$f":"IFERROR(VLOOKUP(E33,'Master Data'!D31:L320,9,0),\"\")","v":""},{"$f":"IFERROR(VLOOKUP(K33,'Master Data'!$H$3:$J$292,3,0),\"\")","v":""}]
[null,30,null,null,null,null,{"$f":"IFERROR(VLOOKUP(E34,'Master Data'!$D$3:$K$292,8,0),\"\")","v":""},"",{"$f":"IFERROR(VLOOKUP(E34,'Master Data'!$D$3:$E$292,2,0),\"\")","v":""},{"$f":"IFERROR(VLOOKUP(I34,'Master Data'!$E$3:$F$292,2,0),\"\")","v":""},{"$f":"IFERROR(VLOOKUP(I34,'Master Data'!$E$3:$H$292,4,0),\"\")","v":""},{"$f":"IFERROR(VLOOKUP(E34,'Master Data'!D32:L321,9,0),\"\")","v":""},{"$f":"IFERROR(VLOOKUP(K34,'Master Data'!$H$3:$J$292,3,0),\"\")","v":""}]
[null,31,null,null,null,null,{"$f":"IFERROR(VLOOKUP(E35,'Master Data'!$D$3:$K$292,8,0),\"\")","v":""},"",{"$f":"IFERROR(VLOOKUP(E35,'Master Data'!$D$3:$E$292,2,0),\"\")","v":""},{"$f":"IFERROR(VLOOKUP(I35,'Master Data'!$E$3:$F$292,2,0),\"\")","v":""},{"$f":"IFERROR(VLOOKUP(I35,'Master Data'!$E$3:$H$292,4,0),\"\")","v":""},{"$f":"IFERROR(VLOOKUP(E35,'Master Data'!D33:L322,9,0),\"\")","v":""},{"$f":"IFERROR(VLOOKUP(K35,'Master Data'!$H$3:$J$292,3,0),\"\")","v":""}]
[null,32,null,null,null,null,{"$f":"IFERROR(VLOOKUP(E36,'Master Data'!$D$3:$K$292,8,0),\"\")","v":""},"",{"$f":"IFERROR(VLOOKUP(E36,'Master Data'!$D$3:$E$292,2,0),\"\")","v":""},{"$f":"IFERROR(VLOOKUP(I36,'Master Data'!$E$3:$F$292,2,0),\"\")","v":""},{"$f":"IFERROR(VLOOKUP(I36,'Master Data'!$E$3:$H$292,4,0),\"\")","v":""},{"$f":"IFERROR(VLOOKUP(E36,'Master Data'!D34:L323,9,0),\"\")","v":""},{"$f":"IFERROR(VLOOKUP(K36,'Master Data'!$H$3:$J$292,3,0),\"\")","v":""}]
[null,33,null,null,null,null,{"$f":"IFERROR(VLOOKUP(E37,'Master Data'!$D$3:$K$292,8,0),\"\")","v":""},"",{"$f":"IFERROR(VLOOKUP(E37,'Master Data'!$D$3:$E$292,2,0),\"\")","v":""},{"$f":"IFERROR(VLOOKUP(I37,'Master Data'!$E$3:$F$292,2,0),\"\")","v":""},{"$f":"IFERROR(VLOOKUP(I37,'Master Data'!$E$3:$H$292,4,0),\"\")","v":""},{"$f":"IFERROR(VLOOKUP(E37,'Master Data'!D35:L324,9,0),\"\")","v":""},{"$f":"IFERROR(VLOOKUP(K37,'Master Data'!$H$3:$J$292,3,0),\"\")","v":""}]
[null,34,null,null,null,null,{"$f":"IFERROR(VLOOKUP(E38,'Master Data'!$D$3:$K$292,8,0),\"\")","v":""},"",{"$f":"IFERROR(VLOOKUP(E38,'Master Data'!$D$3:$E$292,2,0),\"\")","v":""},{"$f":"IFERROR(VLOOKUP(I38,'Master Data'!$E$3:$F$292,2,0),\"\")","v":""},{"$f":"IFERROR(VLOOKUP(I38,'Master Data'!$E$3:$H$292,4,0),\"\")","v":""},{"$f":"IFERROR(VLOOKUP(E38,'Master Data'!D36:L325,9,0),\"\")","v":""},{"$f":"IFERROR(VLOOKUP(K38,'Master Data'!$H$3:$J$292,3,0),\"\")","v":""}]
[null,35,null,null,null,null,{"$f":"IFERROR(VLOOKUP(E39,'Master Data'!$D$3:$K$292,8,0),\"\")","v":""},"",{"$f":"IFERROR(VLOOKUP(E39,'Master Data'!$D$3:$E$292,2,0),\"\")","v":""},{"$f":"IFERROR(VLOOKUP(I39,'Master Data'!$E$3:$F$292,2,0),\"\")","v":""},{"$f":"IFERROR(VLOOKUP(I39,'Master Data'!$E$3:$H$292,4,0),\"\")","v":""},{"$f":"IFERROR(VLOOKUP(E39,'Master Data'!D37:L326,9,0),\"\")","v":""},{"$f":"IFERROR(VLOOKUP(K39,'Master Data'!$H$3:$J$292,3,0),\"\")","v":""}]
[null,36,null,null,null,null,{"$f":"IFERROR(VLOOKUP(E40,'Master Data'!$D$3:$K$292,8,0),\"\")","v":""},"",{"$f":"IFERROR(VLOOKUP(E40,'Master Data'!$D$3:$E$292,2,0),\"\")","v":""},{"$f":"IFERROR(VLOOKUP(I40,'Master Data'!$E$3:$F$292,2,0),\"\")","v":""},{"$f":"IFERROR(VLOOKUP(I40,'Master Data'!$E$3:$H$292,4,0),\"\")","v":""},{"$f":"IFERROR(VLOOKUP(E40,'Master Data'!D38:L327,9,0),\"\")","v":""},{"$f":"IFERROR(VLOOKUP(K40,'Master Data'!$H$3:$J$292,3,0),\"\")","v":""}]
[null,37,null,null,null,null,{"$f":"IFERROR(VLOOKUP(E41,'Master Data'!$D$3:$K$292,8,0),\"\")","v":""},"",{"$f":"IFERROR(VLOOKUP(E41,'Master Data'!$D$3:$E$292,2,0),\"\")","v":""},{"$f":"IFERROR(VLOOKUP(I41,'Master Data'!$E$3:$F$292,2,0),\"\")","v":""},{"$f":"IFERROR(VLOOKUP(I41,'Master Data'!$E$3:$H$292,4,0),\"\")","v":""},{"$f":"IFERROR(VLOOKUP(E41,'Master Data'!D39:L328,9,0),\"\")","v":""},{"$f":"IFERROR(VLOOKUP(K41,'Master Data'!$H$3:$J$292,3,0),\"\")","v":""}]
[null,38,null,null,null,null,{"$f":"IFERROR(VLOOKUP(E42,'Master Data'!$D$3:$K$292,8,0),\"\")","v":""},"",{"$f":"IFERROR(VLOOKUP(E42,'Master Data'!$D$3:$E$292,2,0),\"\")","v":""},{"$f":"IFERROR(VLOOKUP(I42,'Master Data'!$E$3:$F$292,2,0),\"\")","v":""},{"$f":"IFERROR(VLOOKUP(I42,'Master Data'!$E$3:$H$292,4,0),\"\")","v":""},{"$f":"IFERROR(VLOOKUP(E42,'Master Data'!D40:L329,9,0),\"\")","v":""},{"$f":"IFERROR(VLOOKUP(K42,'Master Data'!$H$3:$J$292,3,0),\"\")","v":""}]
[null,39,null,null,null,null,{"$f":"IFERROR(VLOOKUP(E43,'Master Data'!$D$3:$K$292,8,0),\"\")","v":""},"",{"$f":"IFERROR(VLOOKUP(E43,'Master Data'!$D$3:$E$292,2,0),\"\")","v":""},{"$f":"IFERROR(VLOOKUP(I43,'Master Data'!$E$3:$F$292,2,0),\"\")","v":""},{"$f":"IFERROR(VLOOKUP(I43,'Master Data'!$E$3:$H$292,4,0),\"\")","v":""},{"$f":"IFERROR(VLOOKUP(E43,'Master Data'!D41:L330,9,0),\"\")","v":""},{"$f":"IFERROR(VLOOKUP(K43,'Master Data'!$H$3:$J$292,3,0),\"\")","v":""}]
[null,40,null,null,null,null,{"$f":"IFERROR(VLOOKUP(E44,'Master Data'!$D$3:$K$292,8,0),\"\")","v":""},"",{"$f":"IFERROR(VLOOKUP(E44,'Master Data'!$D$3:$E$292,2,0),\"\")","v":""},{"$f":"IFERROR(VLOOKUP(I44,'Master Data'!$E$3:$F$292,2,0),\"\")","v":""},{"$f":"IFERROR(VLOOKUP(I44,'Master Data'!$E$3:$H$292,4,0),\"\")","v":""},{"$f":"IFERROR(VLOOKUP(E44,'Master Data'!D42:L331,9,0),\"\")","v":""},{"$f":"IFERROR(VLOOKUP(K44,'Master Data'!$H$3:$J$292,3,0),\"\")","v":""}]
[null,41,null,null,null,null,{"$f":"IFERROR(VLOOKUP(E45,'Master Data'!$D$3:$K$292,8,0),\"\")","v":""},"",{"$f":"IFERROR(VLOOKUP(E45,'Master Data'!$D$3:$E$292,2,0),\"\")","v":""},{"$f":"IFERROR(VLOOKUP(I45,'Master Data'!$E$3:$F$292,2,0),\"\")","v":""},{"$f":"IFERROR(VLOOKUP(I45,'Master Data'!$E$3:$H$292,4,0),\"\")","v":""},{"$f":"IFERROR(VLOOKUP(E45,'Master Data'!D43:L332,9,0),\"\")","v":""},{"$f":"IFERROR(VLOOKUP(K45,'Master Data'!$H$3:$J$292,3,0),\"\")","v":""}]
[null,42,null,null,null,null,{"$f":"IFERROR(VLOOKUP(E46,'Master Data'!$D$3:$K$292,8,0),\"\")","v":""},"",{"$f":"IFERROR(VLOOKUP(E46,'Master Data'!$D$3:$E$292,2,0),\"\")","v":""},{"$f":"IFERROR(VLOOKUP(I46,'Master Data'!$E$3:$F$292,2,0),\"\")","v":""},{"$f":"IFERROR(VLOOKUP(I46,'Master Data'!$E$3:$H$292,4,0),\"\")","v":""},{"$f":"IFERROR(VLOOKUP(E46,'Master Data'!D44:L333,9,0),\"\")","v":""},{"$f":"IFERROR(VLOOKUP(K46,'Master Data'!$H$3:$J$292,3,0),\"\")","v":""}]
[null,43,null,null,null,null,{"$f":"IFERROR(VLOOKUP(E47,'Master Data'!$D$3:$K$292,8,0),\"\")","v":""},"",{"$f":"IFERROR(VLOOKUP(E47,'Master Data'!$D$3:$E$292,2,0),\"\")","v":""},{"$f":"IFERROR(VLOOKUP(I47,'Master Data'!$E$3:$F$292,2,0),\"\")","v":""},{"$f":"IFERROR(VLOOKUP(I47,'Master Data'!$E$3:$H$292,4,0),\"\")","v":""},{"$f":"IFERROR(VLOOKUP(E47,'Master Data'!D45:L334,9,0),\"\")","v":""},{"$f":"IFERROR(VLOOKUP(K47,'Master Data'!$H$3:$J$292,3,0),\"\")","v":""}]
[null,44,null,null,null,null,{"$f":"IFERROR(VLOOKUP(E48,'Master Data'!$D$3:$K$292,8,0),\"\")","v":""},"",{"$f":"IFERROR(VLOOKUP(E48,'Master Data'!$D$3:$E$292,2,0),\"\")","v":""},{"$f":"IFERROR(VLOOKUP(I48,'Master Data'!$E$3:$F$292,2,0),\"\")","v":""},{"$f":"IFERROR(VLOOKUP(I48,'Master Data'!$E$3:$H$292,4,0),\"\")","v":""},{"$f":"IFERROR(VLOOKUP(E48,'Master Data'!D46:L335,9,0),\"\")","v":""},{"$f":"IFERROR(VLOOKUP(K48,'Master Data'!$H$3:$J$292,3,0),\"\")","v":""}]
[null,45,null,null,null,null,{"$f":"IFERROR(VLOOKUP(E49,'Master Data'!$D$3:$K$292,8,0),\"\")","v":""},"",{"$f":"IFERROR(VLOOKUP(E49,'Master Data'!$D$3:$E$292,2,0),\"\")","v":""},{"$f":"IFERROR(VLOOKUP(I49,'Master Data'!$E$3:$F$292,2,0),\"\")","v":""},{"$f":"IFERROR(VLOOKUP(I49,'Master Data'!$E$3:$H$292,4,0),\"\")","v":""},{"$f":"IFERROR(VLOOKUP(E49,'Master Data'!D47:L336,9,0),\"\")","v":""},{"$f":"IFERROR(VLOOKUP(K49,'Master Data'!$H$3:$J$292,3,0),\"\")","v":""}]
[null,46,null,null,null,null,{"$f":"IFERROR(VLOOKUP(E50,'Master Data'!$D$3:$K$292,8,0),\"\")","v":""},"",{"$f":"IFERROR(VLOOKUP(E50,'Master Data'!$D$3:$E$292,2,0),\"\")","v":""},{"$f":"IFERROR(VLOOKUP(I50,'Master Data'!$E$3:$F$292,2,0),\"\")","v":""},{"$f":"IFERROR(VLOOKUP(I50,'Master Data'!$E$3:$H$292,4,0),\"\")","v":""},{"$f":"IFERROR(VLOOKUP(E50,'Master Data'!D48:L337,9,0),\"\")","v":""},{"$f":"IFERROR(VLOOKUP(K50,'Master Data'!$H$3:$J$292,3,0),\"\")","v":""}]
[null,47,null,null,null,null,{"$f":"IFERROR(VLOOKUP(E51,'Master Data'!$D$3:$K$292,8,0),\"\")","v":""},"",{"$f":"IFERROR(VLOOKUP(E51,'Master Data'!$D$3:$E$292,2,0),\"\")","v":""},{"$f":"IFERROR(VLOOKUP(I51,'Master Data'!$E$3:$F$292,2,0),\"\")","v":""},{"$f":"IFERROR(VLOOKUP(I51,'Master Data'!$E$3:$H$292,4,0),\"\")","v":""},{"$f":"IFERROR(VLOOKUP(E51,'Master Data'!D49:L338,9,0),\"\")","v":""},{"$f":"IFERROR(VLOOKUP(K51,'Master Data'!$H$3:$J$292,3,0),\"\")","v":""}]
[null,48,null,null,null,null,{"$f":"IFERROR(VLOOKUP(E52,'Master Data'!$D$3:$K$292,8,0),\"\")","v":""},"",{"$f":"IFERROR(VLOOKUP(E52,'Master Data'!$D$3:$E$292,2,0),\"\")","v":""},{"$f":"IFERROR(VLOOKUP(I52,'Master Data'!$E$3:$F$292,2,0),\"\")","v":""},{"$f":"IFERROR(VLOOKUP(I52,'Master Data'!$E$3:$H$292,4,0),\"\")","v":""},{"$f":"IFERROR(VLOOKUP(E52,'Master Data'!D50:L339,9,0),\"\")","v":""},{"$f":"IFERROR(VLOOKUP(K52,'Master Data'!$H$3:$J$292,3,0),\"\")","v":""}]
[null,49,null,null,null,null,{"$f":"IFERROR(VLOOKUP(E53,'Master Data'!$D$3:$K$292,8,0),\"\")","v":""},"",{"$f":"IFERROR(VLOOKUP(E53,'Master Data'!$D$3:$E$292,2,0),\"\")","v":""},{"$f":"IFERROR(VLOOKUP(I53,'Master Data'!$E$3:$F$292,2,0),\"\")","v":""},{"$f":"IFERROR(VLOOKUP(I53,'Master Data'!$E$3:$H$292,4,0),\"\")","v":""},{"$f":"IFERROR(VLOOKUP(E53,'Master Data'!D51:L340,9,0),\"\")","v":""},{"$f":"IFERROR(VLOOKUP(K53,'Master Data'!$H$3:$J$292,3,0),\"\")","v":""}]
[null,50,null,null,null,null,{"$f":"IFERROR(VLOOKUP(E54,'Master Data'!$D$3:$K$292,8,0),\"\")","v":""},"",{"$f":"IFERROR(VLOOKUP(E54,'Master Data'!$D$3:$E$292,2,0),\"\")","v":""},{"$f":"IFERROR(VLOOKUP(I54,'Master Data'!$E$3:$F$292,2,0),\"\")","v":""},{"$f":"IFERROR(VLOOKUP(I54,'Master Data'!$E$3:$H$292,4,0),\"\")","v":""},{"$f":"IFERROR(VLOOKUP(E54,'Master Data'!D52:L341,9,0),\"\")","v":""},{"$f":"IFERROR(VLOOKUP(K54,'Master Data'!$H$3:$J$292,3,0),\"\")","v":""}]
[null,51,null,null,null,null,{"$f":"IFERROR(VLOOKUP(E55,'Master Data'!$D$3:$K$292,8,0),\"\")","v":""},"",{"$f":"IFERROR(VLOOKUP(E55,'Master Data'!$D$3:$E$292,2,0),\"\")","v":""},{"$f":"IFERROR(VLOOKUP(I55,'Master Data'!$E$3:$F$292,2,0),\"\")","v":""},{"$f":"IFERROR(VLOOKUP(I55,'Master Data'!$E$3:$H$292,4,0),\"\")","v":""},{"$f":"IFERROR(VLOOKUP(E55,'Master Data'!D53:L342,9,0),\"\")","v":""},{"$f":"IFERROR(VLOOKUP(K55,'Master Data'!$H$3:$J$292,3,0),\"\")","v":""}]
[null,52,null,null,null,null,{"$f":"IFERROR(VLOOKUP(E56,'Master Data'!$D$3:$K$292,8,0),\"\")","v":""},"",{"$f":"IFERROR(VLOOKUP(E56,'Master Data'!$D$3:$E$292,2,0),\"\")","v":""},{"$f":"IFERROR(VLOOKUP(I56,'Master Data'!$E$3:$F$292,2,0),\"\")","v":""},{"$f":"IFERROR(VLOOKUP(I56,'Master Data'!$E$3:$H$292,4,0),\"\")","v":""},{"$f":"IFERROR(VLOOKUP(E56,'Master Data'!D54:L343,9,0),\"\")","v":""},{"$f":"IFERROR(VLOOKUP(K56,'Master Data'!$H$3:$J$292,3,0),\"\")","v":""}]
[null,53,null,null,null,null,{"$f":"IFERROR(VLOOKUP(E57,'Master Data'!$D$3:$K$292,8,0),\"\")","v":""},"",{"$f":"IFERROR(VLOOKUP(E57,'Master Data'!$D$3:$E$292,2,0),\"\")","v":""},{"$f":"IFERROR(VLOOKUP(I57,'Master Data'!$E$3:$F$292,2,0),\"\")","v":""},{"$f":"IFERROR(VLOOKUP(I57,'Master Data'!$E$3:$H$292,4,0),\"\")","v":""},{"$f":"IFERROR(VLOOKUP(E57,'Master Data'!D55:L344,9,0),\"\")","v":""},{"$f":"IFERROR(VLOOKUP(K57,'Master Data'!$H$3:$J$292,3,0),\"\")","v":""}]
[null,54,null,null,null,null,{"$f":"IFERROR(VLOOKUP(E58,'Master Data'!$D$3:$K$292,8,0),\"\")","v":""},"",{"$f":"IFERROR(VLOOKUP(E58,'Master Data'!$D$3:$E$292,2,0),\"\")","v":""},{"$f":"IFERROR(VLOOKUP(I58,'Master Data'!$E$3:$F$292,2,0),\"\")","v":""},{"$f":"IFERROR(VLOOKUP(I58,'Master Data'!$E$3:$H$292,4,0),\"\")","v":""},{"$f":"IFERROR(VLOOKUP(E58,'Master Data'!D56:L345,9,0),\"\")","v":""},{"$f":"IFERROR(VLOOKUP(K58,'Master Data'!$H$3:$J$292,3,0),\"\")","v":""}]
[null,55,null,null,null,null,{"$f":"IFERROR(VLOOKUP(E59,'Master Data'!$D$3:$K$292,8,0),\"\")","v":""},"",{"$f":"IFERROR(VLOOKUP(E59,'Master Data'!$D$3:$E$292,2,0),\"\")","v":""},{"$f":"IFERROR(VLOOKUP(I59,'Master Data'!$E$3:$F$292,2,0),\"\")","v":""},{"$f":"IFERROR(VLOOKUP(I59,'Master Data'!$E$3:$H$292,4,0),\"\")","v":""},{"$f":"IFERROR(VLOOKUP(E59,'Master Data'!D57:L346,9,0),\"\")","v":""},{"$f":"IFERROR(VLOOKUP(K59,'Master Data'!$H$3:$J$292,3,0),\"\")","v":""}]
[null,56,null,null,null,null,{"$f":"IFERROR(VLOOKUP(E60,'Master Data'!$D$3:$K$292,8,0),\"\")","v":""},"",{"$f":"IFERROR(VLOOKUP(E60,'Master Data'!$D$3:$E$292,2,0),\"\")","v":""},{"$f":"IFERROR(VLOOKUP(I60,'Master Data'!$E$3:$F$292,2,0),\"\")","v":""},{"$f":"IFERROR(VLOOKUP(I60,'Master Data'!$E$3:$H$292,4,0),\"\")","v":""},{"$f":"IFERROR(VLOOKUP(E60,'Master Data'!D58:L347,9,0),\"\")","v":""},{"$f":"IFERROR(VLOOKUP(K60,'Master Data'!$H$3:$J$292,3,0),\"\")","v":""}]
[null,57,null,null,null,null,{"$f":"IFERROR(VLOOKUP(E61,'Master Data'!$D$3:$K$292,8,0),\"\")","v":""},"",{"$f":"IFERROR(VLOOKUP(E61,'Master Data'!$D$3:$E$292,2,0),\"\")","v":""},{"$f":"IFERROR(VLOOKUP(I61,'Master Data'!$E$3:$F$292,2,0),\"\")","v":""},{"$f":"IFERROR(VLOOKUP(I61,'Master Data'!$E$3:$H$292,4,0),\"\")","v":""},{"$f":"IFERROR(VLOOKUP(E61,'Master Data'!D59:L348,9,0),\"\")","v":""},{"$f":"IFERROR(VLOOKUP(K61,'Master Data'!$H$3:$J$292,3,0),\"\")","v":""}]
[null,58,null,null,null,null,{"$f":"IFERROR(VLOOKUP(E62,'Master Data'!$D$3:$K$292,8,0),\"\")","v":""},"",{"$f":"IFERROR(VLOOKUP(E62,'Master Data'!$D$3:$E$292,2,0),\"\")","v":""},{"$f":"IFERROR(VLOOKUP(I62,'Master Data'!$E$3:$F$292,2,0),\"\")","v":""},{"$f":"IFERROR(VLOOKUP(I62,'Master Data'!$E$3:$H$292,4,0),\"\")","v":""},{"$f":"IFERROR(VLOOKUP(E62,'Master Data'!D60:L349,9,0),\"\")","v":""},{"$f":"IFERROR(VLOOKUP(K62,'Master Data'!$H$3:$J$292,3,0),\"\")","v":""}]
[null,59,null,null,null,null,{"$f":"IFERROR(VLOOKUP(E63,'Master Data'!$D$3:$K$292,8,0),\"\")","v":""},"",{"$f":"IFERROR(VLOOKUP(E63,'Master Data'!$D$3:$E$292,2,0),\"\")","v":""},{"$f":"IFERROR(VLOOKUP(I63,'Master Data'!$E$3:$F$292,2,0),\"\")","v":""},{"$f":"IFERROR(VLOOKUP(I63,'Master Data'!$E$3:$H$292,4,0),\"\")","v":""},{"$f":"IFERROR(VLOOKUP(E63,'Master Data'!D61:L350,9,0),\"\")","v":""},{"$f":"IFERROR(VLOOKUP(K63,'Master Data'!$H$3:$J$292,3,0),\"\")","v":""}]
[null,60,null,null,null,null,{"$f":"IFERROR(VLOOKUP(E64,'Master Data'!$D$3:$K$292,8,0),\"\")","v":""},"",{"$f":"IFERROR(VLOOKUP(E64,'Master Data'!$D$3:$E$292,2,0),\"\")","v":""},{"$f":"IFERROR(VLOOKUP(I64,'Master Data'!$E$3:$F$292,2,0),\"\")","v":""},{"$f":"IFERROR(VLOOKUP(I64,'Master Data'!$E$3:$H$292,4,0),\"\")","v":""},{"$f":"IFERROR(VLOOKUP(E64,'Master Data'!D62:L351,9,0),\"\")","v":""},{"$f":"IFERROR(VLOOKUP(K64,'Master Data'!$H$3:$J$292,3,0),\"\")","v":""}]
[null,61,null,null,null,null,{"$f":"IFERROR(VLOOKUP(E65,'Master Data'!$D$3:$K$292,8,0),\"\")","v":""},"",{"$f":"IFERROR(VLOOKUP(E65,'Master Data'!$D$3:$E$292,2,0),\"\")","v":""},{"$f":"IFERROR(VLOOKUP(I65,'Master Data'!$E$3:$F$292,2,0),\"\")","v":""},{"$f":"IFERROR(VLOOKUP(I65,'Master Data'!$E$3:$H$292,4,0),\"\")","v":""},{"$f":"IFERROR(VLOOKUP(E65,'Master Data'!D63:L352,9,0),\"\")","v":""},{"$f":"IFERROR(VLOOKUP(K65,'Master Data'!$H$3:$J$292,3,0),\"\")","v":""}]
[null,62,null,null,null,null,{"$f":"IFERROR(VLOOKUP(E66,'Master Data'!$D$3:$K$292,8,0),\"\")","v":""},"",{"$f":"IFERROR(VLOOKUP(E66,'Master Data'!$D$3:$E$292,2,0),\"\")","v":""},{"$f":"IFERROR(VLOOKUP(I66,'Master Data'!$E$3:$F$292,2,0),\"\")","v":""},{"$f":"IFERROR(VLOOKUP(I66,'Master Data'!$E$3:$H$292,4,0),\"\")","v":""},{"$f":"IFERROR(VLOOKUP(E66,'Master Data'!D64:L353,9,0),\"\")","v":""},{"$f":"IFERROR(VLOOKUP(K66,'Master Data'!$H$3:$J$292,3,0),\"\")","v":""}]
[null,63,null,null,null,null,{"$f":"IFERROR(VLOOKUP(E67,'Master Data'!$D$3:$K$292,8,0),\"\")","v":""},"",{"$f":"IFERROR(VLOOKUP(E67,'Master Data'!$D$3:$E$292,2,0),\"\")","v":""},{"$f":"IFERROR(VLOOKUP(I67,'Master Data'!$E$3:$F$292,2,0),\"\")","v":""},{"$f":"IFERROR(VLOOKUP(I67,'Master Data'!$E$3:$H$292,4,0),\"\")","v":""},{"$f":"IFERROR(VLOOKUP(E67,'Master Data'!D65:L354,9,0),\"\")","v":""},{"$f":"IFERROR(VLOOKUP(K67,'Master Data'!$H$3:$J$292,3,0),\"\")","v":""}]
[null,64,null,null,null,null,{"$f":"IFERROR(VLOOKUP(E68,'Master Data'!$D$3:$K$292,8,0),\"\")","v":""},"",{"$f":"IFERROR(VLOOKUP(E68,'Master Data'!$D$3:$E$292,2,0),\"\")","v":""},{"$f":"IFERROR(VLOOKUP(I68,'Master Data'!$E$3:$F$292,2,0),\"\")","v":""},{"$f":"IFERROR(VLOOKUP(I68,'Master Data'!$E$3:$H$292,4,0),\"\")","v":""},{"$f":"IFERROR(VLOOKUP(E68,'Master Data'!D66:L355,9,0),\"\")","v":""},{"$f":"IFERROR(VLOOKUP(K68,'Master Data'!$H$3:$J$292,3,0),\"\")","v":""}]
[null,65,null,null,null,null,{"$f":"IFERROR(VLOOKUP(E69,'Master Data'!$D$3:$K$292,8,0),\"\")","v":""},"",{"$f":"IFERROR(VLOOKUP(E69,'Master Data'!$D$3:$E$292,2,0),\"\")","v":""},{"$f":"IFERROR(VLOOKUP(I69,'Master Data'!$E$3:$F$292,2,0),\"\")","v":""},{"$f":"IFERROR(VLOOKUP(I69,'Master Data'!$E$3:$H$292,4,0),\"\")","v":""},{"$f":"IFERROR(VLOOKUP(E69,'Master Data'!D67:L356,9,0),\"\")","v":""},{"$f":"IFERROR(VLOOKUP(K69,'Master Data'!$H$3:$J$292,3,0),\"\")","v":""}]
[null,66,null,null,null,null,{"$f":"IFERROR(VLOOKUP(E70,'Master Data'!$D$3:$K$292,8,0),\"\")","v":""},{"$f":"IFERROR(F70*G70,\"\")","v":""},{"$f":"IFERROR(VLOOKUP(E70,'Master Data'!$D$3:$E$292,2,0),\"\")","v":""},{"$f":"IFERROR(VLOOKUP(I70,'Master Data'!$E$3:$F$292,2,0),\"\")","v":""},{"$f":"IFERROR(VLOOKUP(I70,'Master Data'!$E$3:$H$292,4,0),\"\")","v":""},{"$f":"IFERROR(VLOOKUP(E70,'Master Data'!D68:L357,9,0),\"\")","v":""},{"$f":"IFERROR(VLOOKUP(K70,'Master Data'!$H$3:$J$292,3,0),\"\")","v":""}]
[null,67,null,null,null,null,{"$f":"IFERROR(VLOOKUP(E71,'Master Data'!$D$3:$K$292,8,0),\"\")","v":""},"",{"$f":"IFERROR(VLOOKUP(E71,'Master Data'!$D$3:$E$292,2,0),\"\")","v":""},{"$f":"IFERROR(VLOOKUP(I71,'Master Data'!$E$3:$F$292,2,0),\"\")","v":""},{"$f":"IFERROR(VLOOKUP(I71,'Master Data'!$E$3:$H$292,4,0),\"\")","v":""},{"$f":"IFERROR(VLOOKUP(E71,'Master Data'!D69:L358,9,0),\"\")","v":""},{"$f":"IFERROR(VLOOKUP(K71,'Master Data'!$H$3:$J$292,3,0),\"\")","v":""}]
[null,68,null,null,null,null,{"$f":"IFERROR(VLOOKUP(E72,'Master Data'!$D$3:$K$292,8,0),\"\")","v":""},"",{"$f":"IFERROR(VLOOKUP(E72,'Master Data'!$D$3:$E$292,2,0),\"\")","v":""},{"$f":"IFERROR(VLOOKUP(I72,'Master Data'!$E$3:$F$292,2,0),\"\")","v":""},{"$f":"IFERROR(VLOOKUP(I72,'Master Data'!$E$3:$H$292,4,0),\"\")","v":""},{"$f":"IFERROR(VLOOKUP(E72,'Master Data'!D70:L359,9,0),\"\")","v":""},{"$f":"IFERROR(VLOOKUP(K72,'Master Data'!$H$3:$J$292,3,0),\"\")","v":""}]
[null,69,null,null,null,null,{"$f":"IFERROR(VLOOKUP(E73,'Master Data'!$D$3:$K$292,8,0),\"\")","v":""},"",{"$f":"IFERROR(VLOOKUP(E73,'Master Data'!$D$3:$E$292,2,0),\"\")","v":""},{"$f":"IFERROR(VLOOKUP(I73,'Master Data'!$E$3:$F$292,2,0),\"\")","v":""},{"$f":"IFERROR(VLOOKUP(I73,'Master Data'!$E$3:$H$292,4,0),\"\")","v":""},{"$f":"IFERROR(VLOOKUP(E73,'Master Data'!D71:L360,9,0),\"\")","v":""},{"$f":"IFERROR(VLOOKUP(K73,'Master Data'!$H$3:$J$292,3,0),\"\")","v":""}]
[null,70,null,null,null,null,{"$f":"IFERROR(VLOOKUP(E74,'Master Data'!$D$3:$K$292,8,0),\"\")","v":""},"",{"$f":"IFERROR(VLOOKUP(E74,'Master Data'!$D$3:$E$292,2,0),\"\")","v":""},{"$f":"IFERROR(VLOOKUP(I74,'Master Data'!$E$3:$F$292,2,0),\"\")","v":""},{"$f":"IFERROR(VLOOKUP(I74,'Master Data'!$E$3:$H$292,4,0),\"\")","v":""},{"$f":"IFERROR(VLOOKUP(E74,'Master Data'!D72:L361,9,0),\"\")","v":""},{"$f":"IFERROR(VLOOKUP(K74,'Master Data'!$H$3:$J$292,3,0),\"\")","v":""}]
[null,71,null,null,null,null,{"$f":"IFERROR(VLOOKUP(E75,'Master Data'!$D$3:$K$292,8,0),\"\")","v":""},"",{"$f":"IFERROR(VLOOKUP(E75,'Master Data'!$D$3:$E$292,2,0),\"\")","v":""},{"$f":"IFERROR(VLOOKUP(I75,'Master Data'!$E$3:$F$292,2,0),\"\")","v":""},{"$f":"IFERROR(VLOOKUP(I75,'Master Data'!$E$3:$H$292,4,0),\"\")","v":""},{"$f":"IFERROR(VLOOKUP(E75,'Master Data'!D73:L362,9,0),\"\")","v":""},{"$f":"IFERROR(VLOOKUP(K75,'Master Data'!$H$3:$J$292,3,0),\"\")","v":""}]
[null,72,null,null,null,null,{"$f":"IFERROR(VLOOKUP(E76,'Master Data'!$D$3:$K$292,8,0),\"\")","v":""},"",{"$f":"IFERROR(VLOOKUP(E76,'Master Data'!$D$3:$E$292,2,0),\"\")","v":""},{"$f":"IFERROR(VLOOKUP(I76,'Master Data'!$E$3:$F$292,2,0),\"\")","v":""},{"$f":"IFERROR(VLOOKUP(I76,'Master Data'!$E$3:$H$292,4,0),\"\")","v":""},{"$f":"IFERROR(VLOOKUP(E76,'Master Data'!D74:L363,9,0),\"\")","v":""},{"$f":"IFERROR(VLOOKUP(K76,'Master Data'!$H$3:$J$292,3,0),\"\")","v":""}]
[null,73,null,null,null,null,{"$f":"IFERROR(VLOOKUP(E77,'Master Data'!$D$3:$K$292,8,0),\"\")","v":""},"",{"$f":"IFERROR(VLOOKUP(E77,'Master Data'!$D$3:$E$292,2,0),\"\")","v":""},{"$f":"IFERROR(VLOOKUP(I77,'Master Data'!$E$3:$F$292,2,0),\"\")","v":""},{"$f":"IFERROR(VLOOKUP(I77,'Master Data'!$E$3:$H$292,4,0),\"\")","v":""},{"$f":"IFERROR(VLOOKUP(E77,'Master Data'!D75:L364,9,0),\"\")","v":""},{"$f":"IFERROR(VLOOKUP(K77,'Master Data'!$H$3:$J$292,3,0),\"\")","v":""}]
[null,74,null,null,null,null,{"$f":"IFERROR(VLOOKUP(E78,'Master Data'!$D$3:$K$292,8,0),\"\")","v":""},"",{"$f":"IFERROR(VLOOKUP(E78,'Master Data'!$D$3:$E$292,2,0),\"\")","v":""},{"$f":"IFERROR(VLOOKUP(I78,'Master Data'!$E$3:$F$292,2,0),\"\")","v":""},{"$f":"IFERROR(VLOOKUP(I78,'Master Data'!$E$3:$H$292,4,0),\"\")","v":""},{"$f":"IFERROR(VLOOKUP(E78,'Master Data'!D76:L365,9,0),\"\")","v":""},{"$f":"IFERROR(VLOOKUP(K78,'Master Data'!$H$3:$J$292,3,0),\"\")","v":""}]
[null,75,null,null,null,null,{"$f":"IFERROR(VLOOKUP(E79,'Master Data'!$D$3:$K$292,8,0),\"\")","v":""},"",{"$f":"IFERROR(VLOOKUP(E79,'Master Data'!$D$3:$E$292,2,0),\"\")","v":""},{"$f":"IFERROR(VLOOKUP(I79,'Master Data'!$E$3:$F$292,2,0),\"\")","v":""},{"$f":"IFERROR(VLOOKUP(I79,'Master Data'!$E$3:$H$292,4,0),\"\")","v":""},{"$f":"IFERROR(VLOOKUP(E79,'Master Data'!D77:L366,9,0),\"\")","v":""},{"$f":"IFERROR(VLOOKUP(K79,'Master Data'!$H$3:$J$292,3,0),\"\")","v":""}]
[null,76,null,null,null,null,{"$f":"IFERROR(VLOOKUP(E80,'Master Data'!$D$3:$K$292,8,0),\"\")","v":""},"",{"$f":"IFERROR(VLOOKUP(E80,'Master Data'!$D$3:$E$292,2,0),\"\")","v":""},{"$f":"IFERROR(VLOOKUP(I80,'Master Data'!$E$3:$F$292,2,0),\"\")","v":""},{"$f":"IFERROR(VLOOKUP(I80,'Master Data'!$E$3:$H$292,4,0),\"\")","v":""},{"$f":"IFERROR(VLOOKUP(E80,'Master Data'!D78:L367,9,0),\"\")","v":""},{"$f":"IFERROR(VLOOKUP(K80,'Master Data'!$H$3:$J$292,3,0),\"\")","v":""}]
[null,77,null,null,null,null,{"$f":"IFERROR(VLOOKUP(E81,'Master Data'!$D$3:$K$292,8,0),\"\")","v":""},"",{"$f":"IFERROR(VLOOKUP(E81,'Master Data'!$D$3:$E$292,2,0),\"\")","v":""},{"$f":"IFERROR(VLOOKUP(I81,'Master Data'!$E$3:$F$292,2,0),\"\")","v":""},{"$f":"IFERROR(VLOOKUP(I81,'Master Data'!$E$3:$H$292,4,0),\"\")","v":""},{"$f":"IFERROR(VLOOKUP(E81,'Master Data'!D79:L368,9,0),\"\")","v":""},{"$f":"IFERROR(VLOOKUP(K81,'Master Data'!$H$3:$J$292,3,0),\"\")","v":""}]
[null,78,null,null,null,null,{"$f":"IFERROR(VLOOKUP(E82,'Master Data'!$D$3:$K$292,8,0),\"\")","v":""},"",{"$f":"IFERROR(VLOOKUP(E82,'Master Data'!$D$3:$E$292,2,0),\"\")","v":""},{"$f":"IFERROR(VLOOKUP(I82,'Master Data'!$E$3:$F$292,2,0),\"\")","v":""},{"$f":"IFERROR(VLOOKUP(I82,'Master Data'!$E$3:$H$292,4,0),\"\")","v":""},{"$f":"IFERROR(VLOOKUP(E82,'Master Data'!D80:L369,9,0),\"\")","v":""},{"$f":"IFERROR(VLOOKUP(K82,'Master Data'!$H$3:$J$292,3,0),\"\")","v":""}]
[null,79,null,null,null,null,{"$f":"IFERROR(VLOOKUP(E83,'Master Data'!$D$3:$K$292,8,0),\"\")","v":""},"",{"$f":"IFERROR(VLOOKUP(E83,'Master Data'!$D$3:$E$292,2,0),\"\")","v":""},{"$f":"IFERROR(VLOOKUP(I83,'Master Data'!$E$3:$F$292,2,0),\"\")","v":""},{"$f":"IFERROR(VLOOKUP(I83,'Master Data'!$E$3:$H$292,4,0),\"\")","v":""},{"$f":"IFERROR(VLOOKUP(E83,'Master Data'!D81:L370,9,0),\"\")","v":""},{"$f":"IFERROR(VLOOKUP(K83,'Master Data'!$H$3:$J$292,3,0),\"\")","v":""}]
[null,80,null,null,null,null,{"$f":"IFERROR(VLOOKUP(E84,'Master Data'!$D$3:$K$292,8,0),\"\")","v":""},"",{"$f":"IFERROR(VLOOKUP(E84,'Master Data'!$D$3:$E$292,2,0),\"\")","v":""},{"$f":"IFERROR(VLOOKUP(I84,'Master Data'!$E$3:$F$292,2,0),\"\")","v":""},{"$f":"IFERROR(VLOOKUP(I84,'Master Data'!$E$3:$H$292,4,0),\"\")","v":""},{"$f":"IFERROR(VLOOKUP(E84,'Master Data'!D82:L371,9,0),\"\")","v":""},{"$f":"IFERROR(VLOOKUP(K84,'Master Data'!$H$3:$J$292,3,0),\"\")","v":""}]
[null,81,null,null,null,null,{"$f":"IFERROR(VLOOKUP(E85,'Master Data'!$D$3:$K$292,8,0),\"\")","v":""},"",{"$f":"IFERROR(VLOOKUP(E85,'Master Data'!$D$3:$E$292,2,0),\"\")","v":""},{"$f":"IFERROR(VLOOKUP(I85,'Master Data'!$E$3:$F$292,2,0),\"\")","v":""},{"$f":"IFERROR(VLOOKUP(I85,'Master Data'!$E$3:$H$292,4,0),\"\")","v":""},{"$f":"IFERROR(VLOOKUP(E85,'Master Data'!D83:L372,9,0),\"\")","v":""},{"$f":"IFERROR(VLOOKUP(K85,'Master Data'!$H$3:$J$292,3,0),\"\")","v":""}]
[null,82,null,null,null,null,{"$f":"IFERROR(VLOOKUP(E86,'Master Data'!$D$3:$K$292,8,0),\"\")","v":""},"",{"$f":"IFERROR(VLOOKUP(E86,'Master Data'!$D$3:$E$292,2,0),\"\")","v":""},{"$f":"IFERROR(VLOOKUP(I86,'Master Data'!$E$3:$F$292,2,0),\"\")","v":""},{"$f":"IFERROR(VLOOKUP(I86,'Master Data'!$E$3:$H$292,4,0),\"\")","v":""},{"$f":"IFERROR(VLOOKUP(E86,'Master Data'!D84:L373,9,0),\"\")","v":""},{"$f":"IFERROR(VLOOKUP(K86,'Master Data'!$H$3:$J$292,3,0),\"\")","v":""}]
[null,83,null,null,null,null,{"$f":"IFERROR(VLOOKUP(E87,'Master Data'!$D$3:$K$292,8,0),\"\")","v":""},"",{"$f":"IFERROR(VLOOKUP(E87,'Master Data'!$D$3:$E$292,2,0),\"\")","v":""},{"$f":"IFERROR(VLOOKUP(I87,'Master Data'!$E$3:$F$292,2,0),\"\")","v":""},{"$f":"IFERROR(VLOOKUP(I87,'Master Data'!$E$3:$H$292,4,0),\"\")","v":""},{"$f":"IFERROR(VLOOKUP(E87,'Master Data'!D85:L374,9,0),\"\")","v":""},{"$f":"IFERROR(VLOOKUP(K87,'Master Data'!$H$3:$J$292,3,0),\"\")","v":""}]
[null,84,null,null,null,null,{"$f":"IFERROR(VLOOKUP(E88,'Master Data'!$D$3:$K$292,8,0),\"\")","v":""},"",{"$f":"IFERROR(VLOOKUP(E88,'Master Data'!$D$3:$E$292,2,0),\"\")","v":""},{"$f":"IFERROR(VLOOKUP(I88,'Master Data'!$E$3:$F$292,2,0),\"\")","v":""},{"$f":"IFERROR(VLOOKUP(I88,'Master Data'!$E$3:$H$292,4,0),\"\")","v":""},{"$f":"IFERROR(VLOOKUP(E88,'Master Data'!D86:L375,9,0),\"\")","v":""},{"$f":"IFERROR(VLOOKUP(K88,'Master Data'!$H$3:$J$292,3,0),\"\")","v":""}]
[null,85,null,null,null,null,{"$f":"IFERROR(VLOOKUP(E89,'Master Data'!$D$3:$K$292,8,0),\"\")","v":""},"",{"$f":"IFERROR(VLOOKUP(E89,'Master Data'!$D$3:$E$292,2,0),\"\")","v":""},{"$f":"IFERROR(VLOOKUP(I89,'Master Data'!$E$3:$F$292,2,0),\"\")","v":""},{"$f":"IFERROR(VLOOKUP(I89,'Master Data'!$E$3:$H$292,4,0),\"\")","v":""},{"$f":"IFERROR(VLOOKUP(E89,'Master Data'!D87:L376,9,0),\"\")","v":""},{"$f":"IFERROR(VLOOKUP(K89,'Master Data'!$H$3:$J$292,3,0),\"\")","v":""}]
[null,86,null,null,null,null,{"$f":"IFERROR(VLOOKUP(E90,'Master Data'!$D$3:$K$292,8,0),\"\")","v":""},"",{"$f":"IFERROR(VLOOKUP(E90,'Master Data'!$D$3:$E$292,2,0),\"\")","v":""},{"$f":"IFERROR(VLOOKUP(I90,'Master Data'!$E$3:$F$292,2,0),\"\")","v":""},{"$f":"IFERROR(VLOOKUP(I90,'Master Data'!$E$3:$H$292,4,0),\"\")","v":""},{"$f":"IFERROR(VLOOKUP(E90,'Master Data'!D88:L377,9,0),\"\")","v":""},{"$f":"IFERROR(VLOOKUP(K90,'Master Data'!$H$3:$J$292,3,0),\"\")","v":""}]
[null,87,null,null,null,null,{"$f":"IFERROR(VLOOKUP(E91,'Master Data'!$D$3:$K$292,8,0),\"\")","v":""},"",{"$f":"IFERROR(VLOOKUP(E91,'Master Data'!$D$3:$E$292,2,0),\"\")","v":""},{"$f":"IFERROR(VLOOKUP(I91,'Master Data'!$E$3:$F$292,2,0),\"\")","v":""},{"$f":"IFERROR(VLOOKUP(I91,'Master Data'!$E$3:$H$292,4,0),\"\")","v":""},{"$f":"IFERROR(VLOOKUP(E91,'Master Data'!D89:L378,9,0),\"\")","v":""},{"$f":"IFERROR(VLOOKUP(K91,'Master Data'!$H$3:$J$292,3,0),\"\")","v":""}]
[null,88,null,null,null,null,{"$f":"IFERROR(VLOOKUP(E92,'Master Data'!$D$3:$K$292,8,0),\"\")","v":""},"",{"$f":"IFERROR(VLOOKUP(E92,'Master Data'!$D$3:$E$292,2,0),\"\")","v":""},{"$f":"IFERROR(VLOOKUP(I92,'Master Data'!$E$3:$F$292,2,0),\"\")","v":""},{"$f":"IFERROR(VLOOKUP(I92,'Master Data'!$E$3:$H$292,4,0),\"\")","v":""},{"$f":"IFERROR(VLOOKUP(E92,'Master Data'!D90:L379,9,0),\"\")","v":""},{"$f":"IFERROR(VLOOKUP(K92,'Master Data'!$H$3:$J$292,3,0),\"\")","v":""}]
[null,89,null,null,null,null,{"$f":"IFERROR(VLOOKUP(E93,'Master Data'!$D$3:$K$292,8,0),\"\")","v":""},"",{"$f":"IFERROR(VLOOKUP(E93,'Master Data'!$D$3:$E$292,2,0),\"\")","v":""},{"$f":"IFERROR(VLOOKUP(I93,'Master Data'!$E$3:$F$292,2,0),\"\")","v":""},{"$f":"IFERROR(VLOOKUP(I93,'Master Data'!$E$3:$H$292,4,0),\"\")","v":""},{"$f":"IFERROR(VLOOKUP(E93,'Master Data'!D91:L380,9,0),\"\")","v":""},{"$f":"IFERROR(VLOOKUP(K93,'Master Data'!$H$3:$J$292,3,0),\"\")","v":""}]
[null,90,null,null,null,null,{"$f":"IFERROR(VLOOKUP(E94,'Master Data'!$D$3:$K$292,8,0),\"\")","v":""},"",{"$f":"IFERROR(VLOOKUP(E94,'Master Data'!$D$3:$E$292,2,0),\"\")","v":""},{"$f":"IFERROR(VLOOKUP(I94,'Master Data'!$E$3:$F$292,2,0),\"\")","v":""},{"$f":"IFERROR(VLOOKUP(I94,'Master Data'!$E$3:$H$292,4,0),\"\")","v":""},{"$f":"IFERROR(VLOOKUP(E94,'Master Data'!D92:L381,9,0),\"\")","v":""},{"$f":"IFERROR(VLOOKUP(K94,'Master Data'!$H$3:$J$292,3,0),\"\")","v":""}]
[null,91,null,null,null,null,{"$f":"IFERROR(VLOOKUP(E95,'Master Data'!$D$3:$K$292,8,0),\"\")","v":""},"",{"$f":"IFERROR(VLOOKUP(E95,'Master Data'!$D$3:$E$292,2,0),\"\")","v":""},{"$f":"IFERROR(VLOOKUP(I95,'Master Data'!$E$3:$F$292,2,0),\"\")","v":""},{"$f":"IFERROR(VLOOKUP(I95,'Master Data'!$E$3:$H$292,4,0),\"\")","v":""},{"$f":"IFERROR(VLOOKUP(E95,'Master Data'!D93:L382,9,0),\"\")","v":""},{"$f":"IFERROR(VLOOKUP(K95,'Master Data'!$H$3:$J$292,3,0),\"\")","v":""}]
[null,92,null,null,null,null,{"$f":"IFERROR(VLOOKUP(E96,'Master Data'!$D$3:$K$292,8,0),\"\")","v":""},"",{"$f":"IFERROR(VLOOKUP(E96,'Master Data'!$D$3:$E$292,2,0),\"\")","v":""},{"$f":"IFERROR(VLOOKUP(I96,'Master Data'!$E$3:$F$292,2,0),\"\")","v":""},{"$f":"IFERROR(VLOOKUP(I96,'Master Data'!$E$3:$H$292,4,0),\"\")","v":""},{"$f":"IFERROR(VLOOKUP(E96,'Master Data'!D94:L383,9,0),\"\")","v":""},{"$f":"IFERROR(VLOOKUP(K96,'Master Data'!$H$3:$J$292,3,0),\"\")","v":""}]
[null,93,null,null,null,null,{"$f":"IFERROR(VLOOKUP(E97,'Master Data'!$D$3:$K$292,8,0),\"\")","v":""},"",{"$f":"IFERROR(VLOOKUP(E97,'Master Data'!$D$3:$E$292,2,0),\"\")","v":""},{"$f":"IFERROR(VLOOKUP(I97,'Master Data'!$E$3:$F$292,2,0),\"\")","v":""},{"$f":"IFERROR(VLOOKUP(I97,'Master Data'!$E$3:$H$292,4,0),\"\")","v":""},{"$f":"IFERROR(VLOOKUP(E97,'Master Data'!D95:L384,9,0),\"\")","v":""},{"$f":"IFERROR(VLOOKUP(K97,'Master Data'!$H$3:$J$292,3,0),\"\")","v":""}]
[null,94,null,null,null,null,{"$f":"IFERROR(VLOOKUP(E98,'Master Data'!$D$3:$K$292,8,0),\"\")","v":""},"",{"$f":"IFERROR(VLOOKUP(E98,'Master Data'!$D$3:$E$292,2,0),\"\")","v":""},{"$f":"IFERROR(VLOOKUP(I98,'Master Data'!$E$3:$F$292,2,0),\"\")","v":""},{"$f":"IFERROR(VLOOKUP(I98,'Master Data'!$E$3:$H$292,4,0),\"\")","v":""},{"$f":"IFERROR(VLOOKUP(E98,'Master Data'!D96:L385,9,0),\"\")","v":""},{"$f":"IFERROR(VLOOKUP(K98,'Master Data'!$H$3:$J$292,3,0),\"\")","v":""}]
[null,95,null,null,null,null,{"$f":"IFERROR(VLOOKUP(E99,'Master Data'!$D$3:$K$292,8,0),\"\")","v":""},"",{"$f":"IFERROR(VLOOKUP(E99,'Master Data'!$D$3:$E$292,2,0),\"\")","v":""},{"$f":"IFERROR(VLOOKUP(I99,'Master Data'!$E$3:$F$292,2,0),\"\")","v":""},{"$f":"IFERROR(VLOOKUP(I99,'Master Data'!$E$3:$H$292,4,0),\"\")","v":""},{"$f":"IFERROR(VLOOKUP(E99,'Master Data'!D97:L386,9,0),\"\")","v":""},{"$f":"IFERROR(VLOOKUP(K99,'Master Data'!$H$3:$J$292,3,0),\"\")","v":""}]
[null,96,null,null,null,null,{"$f":"IFERROR(VLOOKUP(E100,'Master Data'!$D$3:$K$292,8,0),\"\")","v":""},"",{"$f":"IFERROR(VLOOKUP(E100,'Master Data'!$D$3:$E$292,2,0),\"\")","v":""},{"$f":"IFERROR(VLOOKUP(I100,'Master Data'!$E$3:$F$292,2,0),\"\")","v":""},{"$f":"IFERROR(VLOOKUP(I100,'Master Data'!$E$3:$H$292,4,0),\"\")","v":""},{"$f":"IFERROR(VLOOKUP(E100,'Master Data'!D98:L387,9,0),\"\")","v":""},{"$f":"IFERROR(VLOOKUP(K100,'Master Data'!$H$3:$J$292,3,0),\"\")","v":""}]
[null,97,null,null,null,null,{"$f":"IFERROR(VLOOKUP(E101,'Master Data'!$D$3:$K$292,8,0),\"\")","v":""},"",{"$f":"IFERROR(VLOOKUP(E101,'Master Data'!$D$3:$E$292,2,0),\"\")","v":""},{"$f":"IFERROR(VLOOKUP(I101,'Master Data'!$E$3:$F$292,2,0),\"\")","v":""},{"$f":"IFERROR(VLOOKUP(I101,'Master Data'!$E$3:$H$292,4,0),\"\")","v":""},{"$f":"IFERROR(VLOOKUP(E101,'Master Data'!D99:L388,9,0),\"\")","v":""},{"$f":"IFERROR(VLOOKUP(K101,'Master Data'!$H$3:$J$292,3,0),\"\")","v":""}]
[null,98,null,null,null,null,{"$f":"IFERROR(VLOOKUP(E102,'Master Data'!$D$3:$K$292,8,0),\"\")","v":""},"",{"$f":"IFERROR(VLOOKUP(E102,'Master Data'!$D$3:$E$292,2,0),\"\")","v":""},{"$f":"IFERROR(VLOOKUP(I102,'Master Data'!$E$3:$F$292,2,0),\"\")","v":""},{"$f":"IFERROR(VLOOKUP(I102,'Master Data'!$E$3:$H$292,4,0),\"\")","v":""},{"$f":"IFERROR(VLOOKUP(E102,'Master Data'!D100:L389,9,0),\"\")","v":""},{"$f":"IFERROR(VLOOKUP(K102,'Master Data'!$H$3:$J$292,3,0),\"\")","v":""}]
[null,99,null,null,null,null,{"$f":"IFERROR(VLOOKUP(E103,'Master Data'!$D$3:$K$292,8,0),\"\")","v":""},"",{"$f":"IFERROR(VLOOKUP(E103,'Master Data'!$D$3:$E$292,2,0),\"\")","v":""},{"$f":"IFERROR(VLOOKUP(I103,'Master Data'!$E$3:$F$292,2,0),\"\")","v":""},{"$f":"IFERROR(VLOOKUP(I103,'Master Data'!$E$3:$H$292,4,0),\"\")","v":""},{"$f":"IFERROR(VLOOKUP(E103,'Master Data'!D101:L390,9,0),\"\")","v":""},{"$f":"IFERROR(VLOOKUP(K103,'Master Data'!$H$3:$J$292,3,0),\"\")","v":""}]

{"sheet":"Print","index":5,"n_rows":0,"n_cols":0,"rows_kept":0,"cut":false,"hidden":true,"merged":[]}

{"sheet":"Kanban","index":6,"n_rows":0,"n_cols":0,"rows_kept":0,"cut":false,"hidden":false,"merged":[]}