{"text_format":"1","workbook":"xlsx","n_sheets":7,"sheets":["Master Data","QR CODE ASMO","Card Template","Print Template","Data","Print","Kanban"],"not_rendered":{"charts":0,"images":51,"macros":1,"external_links":2,"defined_names":17,"comments":0,"pivot_tables":0},"unopened":[],"bounds":{"document_bytes":16777216,"sheet_cells":100000,"rows_first":2000,"rows_last":500,"rows_between":2000,"halvings":0,"cell_chars":16384,"cell_head_chars":4096},"cells_cut":0,"cells_raw":0,"read":"whole","date_system":"1900"}

{"sheet":"Master Data","index":0,"n_rows":292,"n_cols":12,"rows_kept":292,"cut":false,"hidden":true,"merged":[]}
[null,null,"DATA MASTER PART LIST SUPPLIER"]
[null,"No","Part No","SID No","Part No Drawing","Part Name","Model","Supplier","UoM","Code","Qty/Box","Unique No"]
[null,1,4073470031,"HP02","407347-0031","FRONT PIN RECLINING HINGE OUTER","D01N","TECHNO HOEI","PCS","01THI",200,{"$f":"\"*\"&Table2[[#This Row],[Part No Drawing]]&\"*\"","v":"*407347-0031*"}]
[null,2,4073470042,"HP03","407347-0042","REAR PIN RECLINING HINGE OUTER","D01N","TECHNO HOEI","PCS","01THI",200,{"$f":"\"*\"&Table2[[#This Row],[Part No Drawing]]&\"*\"","v":"*407347-0042*"}]
[null,3,4073470025,"HP04","407347-0025","PIN RECLINING HINGE OUTER","YL8/YR9","TECHNO HOEI","PCS","01THI",200,{"$f":"\"*\"&Table2[[#This Row],[Part No Drawing]]&\"*\"","v":"*407347-0025*"}]
[null,4,8010200107,"RV04","801020-0107","RIVET","660A LL","TECHNO HOEI","PCS","01THI",2000,{"$f":"\"*\"&Table2[[#This Row],[Part No Drawing]]&\"*\"","v":"*801020-0107*"}]
[null,5,8008100862,"PN03","800810-0862","PIN,WITH SHOULDER","3rd REC YL8","TECHNO HOEI","PCS","01THI",1000,{"$f":"\"*\"&Table2[[#This Row],[Part No Drawing]]&\"*\"","v":"*800810-0862*"}]
[null,6,8008100863,"PN04","800810-0863","PIN,WITH SHOULDER","3rd REC YL8","TECHNO HOEI","PCS","01THI",600,{"$f":"\"*\"&Table2[[#This Row],[Part No Drawing]]&\"*\"","v":"*800810-0863*"}]
[null,7,2035400091,"GS01","203540-0091","GEAR SHAFT ","810A","TECHNO HOEI","PCS","01THI",600,{"$f":"\"*\"&Table2[[#This Row],[Part No Drawing]]&\"*\"","v":"*203540-0091*"}]
[null,8,4073490123,"HP01","407349-0123","PIN,REC HNG","YR9 RR REC","TECHNO HOEI","PCS","01THI",500,{"$f":"\"*\"&Table2[[#This Row],[Part No Drawing]]&\"*\"","v":"*407349-0123*"}]
[null,9,8008100831,"PN01","800810-0831","PIN WITH SHOULDER","YR9 RR REC","TECHNO HOEI","PCS","01THI",600,{"$f":"\"*\"&Table2[[#This Row],[Part No Drawing]]&\"*\"","v":"*800810-0831*"}]
[null,10,8008100832,"PN02","800810-0832","PIN WITH SHOULDER","YR9 RR REC","TECHNO HOEI","PCS","01THI",1500,{"$f":"\"*\"&Table2[[#This Row],[Part No Drawing]]&\"*\"","v":"*800810-0832*"}]
[null,11,4079790005,"B147","407979-0005","SHAFT, TUMBLE HINGE","4L45W","TECHNO HOEI","PCS","01THI",60,{"$f":"\"*\"&Table2[[#This Row],[Part No Drawing]]&\"*\"","v":"*407979-0005*"}]
[null,12,4067090026,"PN15","406709-0026","PIN LOCK","D14N FLOOR LOCK","TECHNO HOEI","PCS","01THI",600,{"$f":"\"*\"&Table2[[#This Row],[Part No Drawing]]&\"*\"","v":"*406709-0026*"}]
[null,1,2020730428,"AGS05C","202073-0428","ARM SUB-ASSY, FRONT PWR WDO LIFT, RH","810A REG","ACT METAL","PCS","01AMC",24,{"$f":"\"*\"&Table2[[#This Row],[Part No Drawing]]&\"*\"","v":"*202073-0428*"}]
[null,2,2020740366,"AGS06C","202074-0366","ARM SUB-ASSY, FRONT PWR WDO LIFT, LH","810A REG","ACT METAL","PCS","01AMC",24,{"$f":"\"*\"&Table2[[#This Row],[Part No Drawing]]&\"*\"","v":"*202074-0366*"}]
[null,3,2020710266,"AGS07C","202071-0266","ARM SUB-ASSY, FRONT MNL WDO LIFT, RH","810A REG","ACT METAL","PCS","01AMC",24,{"$f":"\"*\"&Table2[[#This Row],[Part No Drawing]]&\"*\"","v":"*202071-0266*"}]
[null,4,2020720225,"AGS08C","202072-0225","ARM SUB-ASSY, FRONT MNL WDO LIFT, LH","810A REG","ACT METAL","PCS","01AMC",24,{"$f":"\"*\"&Table2[[#This Row],[Part No Drawing]]&\"*\"","v":"*202072-0225*"}]
[null,5,2020730366,"AGS09C","202073-0366","ARM SUB-ASSY, REAR PWR WDO LIFT, RH","810A REG","ACT METAL","PCS","01AMC",24,{"$f":"\"*\"&Table2[[#This Row],[Part No Drawing]]&\"*\"","v":"*202073-0366*"}]
[null,6,2020740333,"AGS10C","202074-0333","ARM SUB-ASSY, REAR PWR WDO LIFT, LH","810A REG","ACT METAL","PCS","01AMC",24,{"$f":"\"*\"&Table2[[#This Row],[Part No Drawing]]&\"*\"","v":"*202074-0333*"}]
[null,7,2020710267,"AGS11C","202071-0267","ARM SUB-ASSY, REAR MNL WDO LIFT, RH","810A REG","ACT METAL","PCS","01AMC",24,{"$f":"\"*\"&Table2[[#This Row],[Part No Drawing]]&\"*\"","v":"*202071-0267*"}]
[null,8,2020720226,"AGS12C","202072-0226","ARM SUB-ASSY, REAR MNL WDO LIFT, LH","810A REG","ACT METAL","PCS","01AMC",24,{"$f":"\"*\"&Table2[[#This Row],[Part No Drawing]]&\"*\"","v":"*202072-0226*"}]
[null,9,2020730470,"AGS13C","202073-0470","ARM SUB-ASSY, FRONT PWR WDO LIFT, RH","660A REG","ACT METAL","PCS","01AMC",24,{"$f":"\"*\"&Table2[[#This Row],[Part No Drawing]]&\"*\"","v":"*202073-0470*"}]
[null,10,2020740402,"AGS14C","202074-0402","ARM SUB-ASSY, FRONT PWR WDO LIFT, LH","660A REG","ACT METAL","PCS","01AMC",24,{"$f":"\"*\"&Table2[[#This Row],[Part No Drawing]]&\"*\"","v":"*202074-0402*"}]
[null,11,2020730484,"AGS15C","202073-0484","ARM SUB-ASSY, REAR PWR WDO LIFT, RH","660A REG","ACT METAL","PCS","01AMC",24,{"$f":"\"*\"&Table2[[#This Row],[Part No Drawing]]&\"*\"","v":"*202073-0484*"}]
[null,12,2020740414,"AGS16C","202074-0414","ARM SUB-ASSY, REAR PWR WDO LIFT, LH","660A REG","ACT METAL","PCS","01AMC",24,{"$f":"\"*\"&Table2[[#This Row],[Part No Drawing]]&\"*\"","v":"*202074-0414*"}]
[null,13,2020730553,"AGS17C","202073-0553","ARM SUB-ASSY, REAR PWR WDO LIFT, RH","800A REG","ACT METAL","PCS","01AMC",24,{"$f":"\"*\"&Table2[[#This Row],[Part No Drawing]]&\"*\"","v":"*202073-0553*"}]
[null,14,2020740472,"AGS18C","202074-0472","ARM SUB-ASSY, REAR PWR WDO LIFT, LH","800A REG","ACT METAL","PCS","01AMC",24,{"$f":"\"*\"&Table2[[#This Row],[Part No Drawing]]&\"*\"","v":"*202074-0472*"}]
[null,15,4510210287,"URS01C","451021-0287","UPPER RAIL OUT. S/A RH","YR9 SEAT TRACK","ACT METAL","PCS","01AMC",14,{"$f":"\"*\"&Table2[[#This Row],[Part No Drawing]]&\"*\"","v":"*451021-0287*"}]
[null,16,4510220264,"URS02C","451022-0264","UPPER RAIL OUT. S/A LH","YR9 SEAT TRACK","ACT METAL","PCS","01AMC",14,{"$f":"\"*\"&Table2[[#This Row],[Part No Drawing]]&\"*\"","v":"*451022-0264*"}]
{"$rows_left_out":263}
{"sheet":"QR CODE ASMO","index":1,"n_rows":29,"n_cols":4,"rows_kept":29,"cut":false,"hidden":true,"merged":[[0,0,1,2]]}
["SHIROKI INDONESIA"]
[]
["NO.","SID NO","QR CODE NO","ID"]
[1,"MO01",null,1]
[2,"MO02",null,2]
[3,"MO03",null,3]
[4,"MO05",null,4]
[5,"MO07",null,5]
[6,"MO08",null,6]
[7,"MO09",null,7]
[8,"MO10",null,8]
[9,"MO11",null,9]
[10,"MO12",null,10]
[11,"MO13",null,11]
[12,"MO16",null,12]
[13,"MO18",null,13]
[14,"MO14",null,14]
[15,"MO15",null,15]
[16,"MO17",null,16]
[17,"MO19",null,17]
[18,"MO21",null,18]
[19,"MO20",null,19]
[20,"MO04",null,20]
[21,"MO06",null,21]
[20,"MO31",null,22]
[21,"MO27",null,23]
[22,"MO28",null,24]
[23,"MO29",null,25]
[24,"MO30",null,26]

{"sheet":"Card Template","index":2,"n_rows":20,"n_cols":54,"rows_kept":20,"cut":false,"hidden":false,"merged":[[2,41,6,52],[2,15,4,39],[19,15,21,24],[7,2,14,13],[15,2,16,13],[17,2,21,13],[4,2,6,13],[2,2,3,13],[15,15,18,39],[11,15,14,39],[19,25,21,39],[15,41,16,52],[17,41,21,52],[7,41,14,52],[6,15,10,39]]}
[null,null,null,null,null,null,null,null,null,null,null,null,null,null,null,null,null,null,null,null,null,null,null,null,null,null,null,null,null,null,null,null,null,null,null,null,null,null,null,null,null,null,null,null,null,null,null,null,null,null,null,null,null,21]
[]
[null,null,"DN NO",null,null,null,null,null,null,null,null,null,null,null,null,"SHOPPING CARD",null,null,null,null,null,null,null,null,null,null,null,null,null,null,null,null,null,null,null,null,null,null,null,null,null,5]
[]
[null,null,"01FKI-ID-18-144-8-13-A"]
[]
[null,null,null,null,null,null,null,null,null,null,null,null,null,null,null,"*404594-0009*"]
[null,null,"2018-08-13",null,null,null,null,null,null,null,null,null,null,null,null,null,null,null,null,null,null,null,null,null,null,null,null,null,null,null,null,null,null,null,null,null,null,null,null,null,null,"hb03"]
[]
[]
[]
[null,null,null,null,null,null,null,null,null,null,null,null,null,null,null,"FRONT HARNESS BRKT INNER LH"]
[]
[]
[]
[null,null,"DARI à",null,null,null,null,null,null,null,null,null,null,null,null,"404594-0009",null,null,null,null,null,null,null,null,null,null,null,null,null,null,null,null,null,null,null,null,null,null,null,null,null,"SAMPAI KE à"]
[]
[null,null,"FUKUYAMA",null,null,null,null,null,null,null,null,null,null,null,null,null,null,null,null,null,null,null,null,null,null,null,null,null,null,null,null,null,null,null,null,null,null,null,null,null,null,"SHIROKI"]
[]
[null,null,null,null,null,null,null,null,null,null,null,null,null,null,null,"QTY/KANBAN",null,null,null,null,null,null,null,null,null,100]

{"sheet":"Print Template","index":3,"n_rows":0,"n_cols":0,"rows_kept":0,"cut":false,"hidden":true,"merged":[]}

{"sheet":"Data","index":4,"n_rows":103,"n_cols":13,"rows_kept":103,"cut":false,"hidden":false,"merged":[]}
[]
[]
[]
[null,"NO","DN TO SUPPLIER","DATE","SID NO","QTY ORDER (KBN)","QTY/BOX","TOTAL ORDER","PART NO","PART NAME","SUPPLIER","UNIQUE NO","SUPPLIER CODE"]
[null,1,"01FKI-ID-18-144-8-13-A","2018-08-13","BK11",1,{"$f":"IFERROR(VLOOKUP(E5,'Master Data'!$D$3:$K$292,8,0),\"\")","v":500},{"$f":"IFERROR(F5*G5,\"\")","v":500},{"$f":"IFERROR(VLOOKUP(E5,'Master Data'!$D$3:$E$292,2,0),\"\")","v":"403758-0004"},{"$f":"IFERROR(VLOOKUP(I5,'Master Data'!$E$3:$F$292,2,0),\"\")","v":"BRACKET, SEAT TRACK UPPER RAIL FR INNER"},{"$f":"IFERROR(VLOOKUP(I5,'Master Data'!$E$3:$H$292,4,0),\"\")","v":"FUKUYAMA"},{"$f":"IFERROR(VLOOKUP(E5,'Master Data'!D3:L292,9,0),\"\")","v":"*403758-0004*"},{"$f":"IFERROR(VLOOKUP(K5,'Master Data'!$H$3:$J$292,3,0),\"\")","v":"01FKI"}]
[null,2,"01FKI-ID-18-144-8-13-A","2018-08-13","B025",3,{"$f":"IFERROR(VLOOKUP(E6,'Master Data'!$D$3:$K$292,8,0),\"\")","v":24},{"$f":"IFERROR(F6*G6,\"\")","v":72},{"$f":"IFERROR(VLOOKUP(E6,'Master Data'!$D$3:$E$292,2,0),\"\")","v":"453209-0025"},{"$f":"IFERROR(VLOOKUP(I6,'Master Data'!$E$3:$F$292,2,0),\"\")","v":"YR9 HANDLE FR SEAT ADJUSTER"},{"$f":"IFERROR(VLOOKUP(I6,'Master Data'!$E$3:$H$292,4,0),\"\")","v":"FUKUYAMA"},{"$f":"IFERROR(VLOOKUP(E6,'Master Data'!D4:L293,9,0),\"\")","v":"*453209-0025*"},{"$f":"IFERROR(VLOOKUP(K6,'Master Data'!$H$3:$J$292,3,0),\"\")","v":"01FKI"}]
[null,3,"01FKI-ID-18-144-8-13-A","2018-08-13","hb02",4,{"$f":"IFERROR(VLOOKUP(E7,'Master Data'!$D$3:$K$292,8,0),\"\")","v":100},400,{"$f":"IFERROR(VLOOKUP(E7,'Master Data'!$D$3:$E$292,2,0),\"\")","v":"404593-0012"},{"$f":"IFERROR(VLOOKUP(I7,'Master Data'!$E$3:$F$292,2,0),\"\")","v":"FRONT HARNESS BRKT INNER RH"},{"$f":"IFERROR(VLOOKUP(I7,'Master Data'!$E$3:$H$292,4,0),\"\")","v":"FUKUYAMA"},{"$f":"IFERROR(VLOOKUP(E7,'Master Data'!D5:L294,9,0),\"\")","v":"*404593-0012*"},{"$f":"IFERROR(VLOOKUP(K7,'Master Data'!$H$3:$J$292,3,0),\"\")","v":"01FKI"}]
[null,4,"01FKI-ID-18-144-8-13-A","2018-08-13","hb03",5,{"$f":"IFERROR(VLOOKUP(E8,'Master Data'!$D$3:$K$292,8,0),\"\")","v":100},500,{"$f":"IFERROR(VLOOKUP(E8,'Master Data'!$D$3:$E$292,2,0),\"\")","v":"404594-0009"},{"$f":"IFERROR(VLOOKUP(I8,'Master Data'!$E$3:$F$292,2,0),\"\")","v":"FRONT HARNESS BRKT INNER LH"},{"$f":"IFERROR(VLOOKUP(I8,'Master Data'!$E$3:$H$292,4,0),\"\")","v":"FUKUYAMA"},{"$f":"IFERROR(VLOOKUP(E8,'Master Data'!D6:L295,9,0),\"\")","v":"*404594-0009*"},{"$f":"IFERROR(VLOOKUP(K8,'Master Data'!$H$3:$J$292,3,0),\"\")","v":"01FKI"}]
[null,5,null,null,null,null,{"$f":"IFERROR(VLOOKUP(E9,'Master Data'!$D$3:$K$292,8,0),\"\")","v":""},"",{"$f":"IFERROR(VLOOKUP(E9,'Master Data'!$D$3:$E$292,2,0),\"\")","v":""},{"$f":"IFERROR(VLOOKUP(I9,'Master Data'!$E$3:$F$292,2,0),\"\")","v":""},{"$f":"IFERROR(VLOOKUP(I9,'Master Data'!$E$3:$H$292,4,0),\"\")","v":""},{"$f":"IFERROR(VLOOKUP(E9,'Master Data'!D7:L296,9,0),\"\")","v":""},{"$f":"IFERROR(VLOOKUP(K9,'Master Data'!$H$3:$J$292,3,0),\"\")","v":""}]
[null,6,null,null,null,null,{"$f":"IFERROR(VLOOKUP(E10,'Master Data'!$D$3:$K$292,8,0),\"\")","v":""},"",{"$f":"IFERROR(VLOOKUP(E10,'Master Data'!$D$3:$E$292,2,0),\"\")","v":""},{"$f":"IFERROR(VLOOKUP(I10,'Master Data'!$E$3:$F$292,2,0),\"\")","v":""},{"$f":"IFERROR(VLOOKUP(I10,'Master Data'!$E$3:$H$292,4,0),\"\")","v":""},{"$f":"IFERROR(VLOOKUP(E10,'Master Data'!D8:L297,9,0),\"\")","v":""},{"$f":"IFERROR(VLOOKUP(K10,'Master Data'!$H$3:$J$292,3,0),\"\")","v":""}]
[null,7,null,null,null,null,{"$f":"IFERROR(VLOOKUP(E11,'Master Data'!$D$3:$K$292,8,0),\"\")","v":""},"",{"$f":"IFERROR(VLOOKUP(E11,'Master Data'!$D$3:$E$292,2,0),\"\")","v":""},{"$f":"IFERROR(VLOOKUP(I11,'Master Data'!$E$3:$F$292,2,0),\"\")","v":""},{"$f":"IFERROR(VLOOKUP(I11,'Master Data'!$E$3:$H$292,4,0),\"\")","v":""},{"$f":"IFERROR(VLOOKUP(E11,'Master Data'!D9:L298,9,0),\"\")","v":""},{"$f":"IFERROR(VLOOKUP(K11,'Master Data'!$H$3:$J$292,3,0),\"\")","v":""}]
[null,8,null,null,null,null,{"$f":"IFERROR(VLOOKUP(E12,'Master Data'!$D$3:$K$292,8,0),\"\")","v":""},"",{"$f":"IFERROR(VLOOKUP(E12,'Master Data'!$D$3:$E$292,2,0),\"\")","v":""},{"$f":"IFERROR(VLOOKUP(I12,'Master Data'!$E$3:$F$292,2,0),\"\")","v":""},{"$f":"IFERROR(VLOOKUP(I12,'Master Data'!$E$3:$H$292,4,0),\"\")","v":""},{"$f":"IFERROR(VLOOKUP(E12,'Master Data'!D10:L299,9,0),\"\")","v":""},{"$f":"IFERROR(VLOOKUP(K12,'Master Data'!$H$3:$J$292,3,0),\"\")","v":""}]
[null,9,null,null,null,null,{"$f":"IFERROR(VLOOKUP(E13,'Master Data'!$D$3:$K$292,8,0),\"\")","v":""},"",{"$f":"IFERROR(VLOOKUP(E13,'Master Data'!$D$3:$E$292,2,0),\"\")","v":""},{"$f":"IFERROR(VLOOKUP(I13,'Master Data'!$E$3:$F$292,2,0),\"\")","v":""},{"$f":"IFERROR(VLOOKUP(I13,'Master Data'!$E$3:$H$292,4,0),\"\")","v":""},{"$f":"IFERROR(VLOOKUP(E13,'Master Data'!D11:L300,9,0),\"\")","v":""},{"$f":"IFERROR(VLOOKUP(K13,'Master Data'!$H$3:$J$292,3,0),\"\")","v":""}]
[null,10,null,null,null,null,{"$f":"IFERROR(VLOOKUP(E14,'Master Data'!$D$3:$K$292,8,0),\"\")","v":""},"",{"$f":"IFERROR(VLOOKUP(E14,'Master Data'!$D$3:$E$292,2,0),\"\")","v":""},{"$f":"IFERROR(VLOOKUP(I14,'Master Data'!$E$3:$F$292,2,0),\"\")","v":""},{"$f":"IFERROR(VLOOKUP(I14,'Master Data'!$E$3:$H$292,4,0),\"\")","v":""},{"$f":"IFERROR(VLOOKUP(E14,'Master Data'!D12:L301,9,0),\"\")","v":""},{"$f":"IFERROR(VLOOKUP(K14,'Master Data'!$H$3:$J$292,3,0),\"\")","v":""}]
[null,11,null,null,null,null,{"$f":"IFERROR(VLOOKUP(E15,'Master Data'!$D$3:$K$292,8,0),\"\")","v":""},"",{"$f":"IFERROR(VLOOKUP(E15,'Master Data'!$D$3:$E$292,2,0),\"\")","v":""},{"$f":"IFERROR(VLOOKUP(I15,'Master Data'!$E$3:$F$292,2,0),\"\")","v":""},{"$f":"IFERROR(VLOOKUP(I15,'Master Data'!$E$3:$H$292,4,0),\"\")","v":""},{"$f":"IFERROR(VLOOKUP(E15,'Master Data'!D13:L302,9,0),\"\")","v":""},{"$f":"IFERROR(VLOOKUP(K15,'Master Data'!$H$3:$J$292,3,0),\"\")","v":""}]
[null,12,null,null,null,null,{"$f":"IFERROR(VLOOKUP(E16,'Master Data'!$D$3:$K$292,8,0),\"\")","v":""},"",{"$f":"IFERROR(VLOOKUP(E16,'Master Data'!$D$3:$E$292,2,0),\"\")","v":""},{"$f":"IFERROR(VLOOKUP(I16,'Master Data'!$E$3:$F$292,2,0),\"\")","v":""},{"$f":"IFERROR(VLOOKUP(I16,'Master Data'!$E$3:$H$292,4,0),\"\")","v":""},{"$f":"IFERROR(VLOOKUP(E16,'Master Data'!D14:L303,9,0),\"\")","v":""},{"$f":"IFERROR(VLOOKUP(K16,'Master Data'!$H$3:$J$292,3,0),\"\")","v":""}]
[null,13,null,null,null,null,{"$f":"IFERROR(VLOOKUP(E17,'Master Data'!$D$3:$K$292,8,0),\"\")","v":""},"",{"$f":"IFERROR(VLOOKUP(E17,'Master Data'!$D$3:$E$292,2,0),\"\")","v":""},{"$f":"IFERROR(VLOOKUP(I17,'Master Data'!$E$3:$F$292,2,0),\"\")","v":""},{"$f":"IFERROR(VLOOKUP(I17,'Master Data'!$E$3:$H$292,4,0),\"\")","v":""},{"$f":"IFERROR(VLOOKUP(E17,'Master Data'!D15:L304,9,0),\"\")","v":""},{"$f":"IFERROR(VLOOKUP(K17,'Master Data'!$H$3:$J$292,3,0),\"\")","v":""}]
[null,14,null,null,null,null,{"$f":"IFERROR(VLOOKUP(E18,'Master Data'!$D$3:$K$292,8,0),\"\")","v":""},"",{"$f":"IFERROR(VLOOKUP(E18,'Master Data'!$D$3:$E$292,2,0),\"\")","v":""},{"$f":"IFERROR(VLOOKUP(I18,'Master Data'!$E$3:$F$292,2,0),\"\")","v":""},{"$f":"IFERROR(VLOOKUP(I18,'Master Data'!$E$3:$H$292,4,0),\"\")","v":""},{"$f":"IFERROR(VLOOKUP(E18,'Master Data'!D16:L305,9,0),\"\")","v":""},{"$f":"IFERROR(VLOOKUP(K18,'Master Data'!$H$3:$J$292,3,0),\"\")","v":""}]
[null,15,null,null,null,null,{"$f":"IFERROR(VLOOKUP(E19,'Master Data'!$D$3:$K$292,8,0),\"\")","v":""},"",{"$f":"IFERROR(VLOOKUP(E19,'Master Data'!$D$3:$E$292,2,0),\"\")","v":""},{"$f":"IFERROR(VLOOKUP(I19,'Master Data'!$E$3:$F$292,2,0),\"\")","v":""},{"$f":"IFERROR(VLOOKUP(I19,'Master Data'!$E$3:$H$292,4,0),\"\")","v":""},{"$f":"IFERROR(VLOOKUP(E19,'Master Data'!D17:L306,9,0),\"\")","v":""},{"$f":"IFERROR(VLOOKUP(K19,'Master Data'!$H$3:$J$292,3,0),\"\")","v":""}]
[null,16,null,null,null,null,{"$f":"IFERROR(VLOOKUP(E20,'Master Data'!$D$3:$K$292,8,0),\"\")","v":""},"",{"$f":"IFERROR(VLOOKUP(E20,'Master Data'!$D$3:$E$292,2,0),\"\")","v":""},{"$f":"IFERROR(VLOOKUP(I20,'Master Data'!$E$3:$F$292,2,0),\"\")","v":""},{"$f":"IFERROR(VLOOKUP(I20,'Master Data'!$E$3:$H$292,4,0),\"\")","v":""},{"$f":"IFERROR(VLOOKUP(E20,'Master Data'!D18:L307,9,0),\"\")","v":""},{"$f":"IFERROR(VLOOKUP(K20,'Master Data'!$H$3:$J$292,3,0),\"\")","v":""}]
[null,17,null,null,null,null,{"$f":"IFERROR(VLOOKUP(E21,'Master Data'!$D$3:$K$292,8,0),\"\")","v":""},"",{"$f":"IFERROR(VLOOKUP(E21,'Master Data'!$D$3:$E$292,2,0),\"\")","v":""},{"$f":"IFERROR(VLOOKUP(I21,'Master Data'!$E$3:$F$292,2,0),\"\")","v":""},{"$f":"IFERROR(VLOOKUP(I21,'Master Data'!$E$3:$H$292,4,0),\"\")","v":""},{"$f":"IFERROR(VLOOKUP(E21,'Master Data'!D19:L308,9,0),\"\")","v":""},{"$f":"IFERROR(VLOOKUP(K21,'Master Data'!$H$3:$J$292,3,0),\"\")","v":""}]
[null,18,null,null,null,null,{"$f":"IFERROR(VLOOKUP(E22,'Master Data'!$D$3:$K$292,8,0),\"\")","v":""},"",{"$f":"IFERROR(VLOOKUP(E22,'Master Data'!$D$3:$E$292,2,0),\"\")","v":""},{"$f":"IFERROR(VLOOKUP(I22,'Master Data'!$E$3:$F$292,2,0),\"\")","v":""},{"$f":"IFERROR(VLOOKUP(I22,'Master Data'!$E$3:$H$292,4,0),\"\")","v":""},{"$f":"IFERROR(VLOOKUP(E22,'Master Data'!D20:L309,9,0),\"\")","v":""},{"$f":"IFERROR(VLOOKUP(K22,'Master Data'!$H$3:$J$292,3,0),\"\")","v":""}]
[null,19,null,null,null,null,{"$f":"IFERROR(VLOOKUP(E23,'Master Data'!$D$3:$K$292,8,0),\"\")","v":""},"",{"$f":"IFERROR(VLOOKUP(E23,'Master Data'!$D$3:$E$292,2,0),\"\")","v":""},{"$f":"IFERROR(VLOOKUP(I23,'Master Data'!$E$3:$F$292,2,0),\"\")","v":""},{"$f":"IFERROR(VLOOKUP(I23,'Master Data'!$E$3:$H$292,4,0),\"\")","v":""},{"$f":"IFERROR(VLOOKUP(E23,'Master Data'!D21:L310,9,0),\"\")","v":""},{"$f":"IFERROR(VLOOKUP(K23,'Master Data'!$H$3:$J$292,3,0),\"\")","v":""}]
[null,20,null,null,null,null,{"$f":"IFERROR(VLOOKUP(E24,'Master Data'!$D$3:$K$292,8,0),\"\")","v":""},"",{"$f":"IFERROR(VLOOKUP(E24,'Master Data'!$D$3:$E$292,2,0),\"\")","v":""},{"$f":"IFERROR(VLOOKUP(I24,'Master Data'!$E$3:$F$292,2,0),\"\")","v":""},{"$f":"IFERROR(VLOOKUP(I24,'Master Data'!$E$3:$H$292,4,0),\"\")","v":""},{"$f":"IFERROR(VLOOKUP(E24,'Master Data'!D22:L311,9,0),\"\")","v":""},{"$f":"IFERROR(VLOOKUP(K24,'Master Data'!$H$3:$J$292,3,0),\"\")","v":""}]
[null,21,null,null,null,null,{"$f":"IFERROR(VLOOKUP(E25,'Master Data'!$D$3:$K$292,8,0),\"\")","v":""},"",{"$f":"IFERROR(VLOOKUP(E25,'Master Data'!$D$3:$E$292,2,0),\"\")","v":""},{"$f":"IFERROR(VLOOKUP(I25,'Master Data'!$E$3:$F$292,2,0),\"\")","v":""},{"$f":"IFERROR(VLOOKUP(I25,'Master Data'!$E$3:$H$292,4,0),\"\")","v":""},{"$f":"IFERROR(VLOOKUP(E25,'Master Data'!D23:L312,9,0),\"\")","v":""},{"$f":"IFERROR(VLOOKUP(K25,'Master Data'!$H$3:$J$292,3,0),\"\")","v":""}]
[null,22,null,null,null,null,{"$f":"IFERROR(VLOOKUP(E26,'Master Data'!$D$3:$K$292,8,0),\"\")","v":""},"",{"$f":"IFERROR(VLOOKUP(E26,'Master Data'!$D$3:$E$292,2,0),\"\")","v":""},{"$f":"IFERROR(VLOOKUP(I26,'Master Data'!$E$3:$F$292,2,0),\"\")","v":""},{"$f":"IFERROR(VLOOKUP(I26,'Master Data'!$E$3:$H$292,4,0),\"\")","v":""},{"$f":"IFERROR(VLOOKUP(E26,'Master Data'!D24:L313,9,0),\"\")","v":""},{"$f":"IFERROR(VLOOKUP(K26,'Master Data'!$H$3:$J$292,3,0),\"\")","v":""}]
[null,23,null,null,null,null,{"$f":"IFERROR(VLOOKUP(E27,'Master Data'!$D$3:$K$292,8,0),\"\")","v":""},"",{"$f":"IFERROR(VLOOKUP(E27,'Master Data'!$D$3:$E$292,2,0),\"\")","v":""},{"$f":"IFERROR(VLOOKUP(I27,'Master Data'!$E$3:$F$292,2,0),\"\")","v":""},{"$f":"IFERROR(VLOOKUP(I27,'Master Data'!$E$3:$H$292,4,0),\"\")","v":""},{"$f":"IFERROR(VLOOKUP(E27,'Master Data'!D25:L314,9,0),\"\")","v":""},{"$f":"IFERROR(VLOOKUP(K27,'Master Data'!$H$3:$J$292,3,0),\"\")","v":""}]
[null,24,null,null,null,null,{"$f":"IFERROR(VLOOKUP(E28,'Master Data'!$D$3:$K$292,8,0),\"\")","v":""},"",{"$f":"IFERROR(VLOOKUP(E28,'Master Data'!$D$3:$E$292,2,0),\"\")","v":""},{"$f":"IFERROR(VLOOKUP(I28,'Master Data'!$E$3:$F$292,2,0),\"\")","v":""},{"$f":"IFERROR(VLOOKUP(I28,'Master Data'!$E$3:$H$292,4,0),\"\")","v":""},{"$f":"IFERROR(VLOOKUP(E28,'Master Data'!D26:L315,9,0),\"\")","v":""},{"$f":"IFERROR(VLOOKUP(K28,'Master Data'!$H$3:$J$292,3,0),\"\")","v":""}]
[null,25,null,null,null,null,{"$f":"IFERROR(VLOOKUP(E29,'Master Data'!$D$3:$K$292,8,0),\"\")","v":""},"",{"$f":"IFERROR(VLOOKUP(E29,'Master Data'!$D$3:$E$292,2,0),\"\")","v":""},{"$f":"IFERROR(VLOOKUP(I29,'Master Data'!$E$3:$F$292,2,0),\"\")","v":""},{"$f":"IFERROR(VLOOKUP(I29,'Master Data'!$E$3:$H$292,4,0),\"\")","v":""},{"$f":"IFERROR(VLOOKUP(E29,'Master Data'!D27:L316,9,0),\"\")","v":""},{"$f":"IFERROR(VLOOKUP(K29,'Master Data'!$H$3:$J$292,3,0),\"\")","v":""}]
[null,26,null,null,null,null,{"$f":"IFERROR(VLOOKUP(E30,'Master Data'!$D$3:$K$292,8,0),\"\")","v":""},"",{"$f":"IFERROR(VLOOKUP(E30,'Master Data'!$D$3:$E$292,2,0),\"\")","v":""},{"$f":"IFERROR(VLOOKUP(I30,'Master Data'!$E$3:$F$292,2,0),\"\")","v":""},{"$f":"IFERROR(VLOOKUP(I30,'Master Data'!$E$3:$H$292,4,0),\"\")","v":""},{"$f":"IFERROR(VLOOKUP(E30,'Master Data'!D28:L317,9,0),\"\")","v":""},{"$f":"IFERROR(VLOOKUP(K30,'Master Data'!$H$3:$J$292,3,0),\"\")","v":""}]
{"$rows_left_out":74}
{"sheet":"Print","index":5,"n_rows":0,"n_cols":0,"rows_kept":0,"cut":false,"hidden":true,"merged":[]}

{"sheet":"Kanban","index":6,"n_rows":0,"n_cols":0,"rows_kept":0,"cut":false,"hidden":false,"merged":[]}